{"text_format":"3","workbook":"xlsx","n_sheets":9,"sheets":["Data","Lookups","Main","Background notes","Table1","Table2","Table3","Table4","Table5"],"not_rendered":{"charts":6,"images":10,"macros":1,"defined_names":9},"read":"whole","date_system":"1900"}

{"sheet":"Data","index":0,"n_rows":333,"n_cols":22,"rows_kept":333,"hidden":true,"merged":[[1,4,1,10],[1,11,1,16],[1,17,1,20],[1,21,2,21]]}
[null,1,2,3,4,5,6,7,8,9,10,11,12,13,14,15,16,17,18,19,20,21]
[{"$nulls":4},"Clients",{"$nulls":6},"Expenditure",{"$nulls":5},"Expenditure withOUT overheads",{"$nulls":3},"65+ Pops"]
[null,null,"Local Authority","Year","LS 65+ CH","CH_ALL","CH_FPC","CH_FNC","HC - 65+","HC_FPC","HC_AvHrs","CareHomes","CH_FPC","CH_FNC","CH_FPNC","Homecare","HC_FPC","CH_FPC","CH_FNC","CH_FPNC","HC_FPC"]
[null,{"$f":"C4&D4","v":"Aberdeen City2007-08"},"Aberdeen City","2007-08",1590,510,500,360,{"v":1980,"d":"1,980"},{"v":1810,"d":"1,810"},{"v":13800,"d":"13,800"},{"v":27098,"d":"27,098"},{"v":3381,"d":"3,381"},{"v":1187,"d":"1,187"},{"v":4568,"d":"4,568"},{"v":13303,"d":"13,303"},{"v":9912,"d":"9,912"},{"v":3268,"d":"3,268"},{"v":1148,"d":"1,148"},{"v":4416,"d":"4,416"},{"v":9502,"d":"9,502"},{"v":32165,"d":"32,165"}]
[null,"Aberdeenshire2007-08","Aberdeenshire","2007-08",1360,470,460,350,{"v":2100,"d":"2,100"},{"v":1920,"d":"1,920"},{"v":11300,"d":"11,300"},{"v":23567,"d":"23,567"},{"v":3873,"d":"3,873"},{"v":1302,"d":"1,302"},{"v":5175,"d":"5,175"},{"v":12133,"d":"12,133"},{"v":10857,"d":"10,857"},{"v":3604,"d":"3,604"},{"v":1212,"d":"1,212"},{"v":4816,"d":"4,816"},{"v":10105,"d":"10,105"},{"v":37339,"d":"37,339"}]
[null,"Angus2007-08","Angus","2007-08",680,300,300,120,{"v":1610,"d":"1,610"},810,{"v":3300,"d":"3,300"},{"v":14749,"d":"14,749"},{"v":2158,"d":"2,158"},384,{"v":2542,"d":"2,542"},{"v":6994,"d":"6,994"},{"v":2483,"d":"2,483"},{"v":2043,"d":"2,043"},364,{"v":2407,"d":"2,407"},{"v":2351,"d":"2,351"},{"v":21312,"d":"21,312"}]
[null,"Argyll & Bute2007-08","Argyll & Bute","2007-08",790,220,220,70,740,560,{"v":5300,"d":"5,300"},{"v":12578,"d":"12,578"},{"v":1926,"d":"1,926"},260,{"v":2186,"d":"2,186"},{"v":7359,"d":"7,359"},{"v":6397,"d":"6,397"},{"v":1673,"d":"1,673"},225,{"v":1898,"d":"1,898"},{"v":5473,"d":"5,473"},{"v":18267,"d":"18,267"}]
[null,"Clackmannanshire2007-08","Clackmannanshire","2007-08",250,50,50,40,590,500,{"v":3900,"d":"3,900"},{"v":3857,"d":"3,857"},399,151,550,{"v":1786,"d":"1,786"},{"v":2478,"d":"2,478"},369,140,509,{"v":2294,"d":"2,294"},{"v":7533,"d":"7,533"}]
{"$rows_left_out":326}
{"sheet":"Lookups","index":1,"n_rows":35,"n_cols":11,"rows_kept":35,"hidden":true}
[]
["Year",null,"Local Authority",null,null,"Clients",null,"Long-stay residents aged 65+ supported in Care Homes",4,11,11]
["2005-06",null,"Scotland",null,null,"Expenditure (£thousands - including overheads)",null,"Self-funders receiving FPNC or FPC only or FNC only in Care Homes",5,14,19]
["2006-07",null,"Aberdeen City",null,null,"Expenditure (£thousands - excluding overheads)",null,"Self-funders 65+ receiving FPC in Care Homes",6,12,17]
["2007-08",null,"Aberdeenshire",{"$nulls":4},"Self-funders receiving FNC in Care Homes",7,13,18]
["2008-09",null,"Angus"]
["2009-10",null,"Argyll & Bute"]
["2010-11",null,"Clackmannanshire",{"$nulls":4},"Home Care Clients aged 65+",8,15,15]
{"$rows_left_out":28}
{"sheet":"Main","index":2,"n_rows":22,"n_cols":10,"rows_kept":22,"merged":[[2,1,2,9],[3,1,3,6],[8,2,8,8],[10,2,10,8],[12,2,12,8],[14,2,14,8],[16,2,16,8],[19,1,19,9],[21,1,21,9]]}
[null,"Free Personal & Nursing Care 2007-08 to 2016-17"]
[]
[null,"This spreadsheet presents the latest figures for free personal care (FPC) and free nursing care (FNC). Free personal and nursing care (FPNC) was introduced in Scotland on 1 July 2002.  Prior to 1 July 2002, people could be charged for personal care services provided in their own home and many residents in Care Homes had to fully fund their care from their own income and savings.  \n\nCare at home: \nb people aged 65 and over can no longer be charged for personal care services provided in their own home.  They can however be charged for domestic services such as help with shopping or housework but any charge would be subject to a financial assessment.  \n\nCare Homes:\nb people aged 65 or over who live in care homes and are assessed as self-funders can receive a weekly payment towards their personal care. This weekly FPC payment was set at £145 from 1 July 2002 and has risen to £171 from 1 April 2015. \nb people of all ages who live in care homes and are assessed as self-funders can receive a further payment if they require nursing care. This weekly FNC payment was set at £65 from 1 July 2002 and has risen to £78 from 1 April 2015.\nb the remainder of the care homes fees are funded themselves. "]
[null,"Please refer to the background notes for further information on the data collection",{"$nulls":5},"Background notes"]
[]
[null,"Contents",{"$nulls":7},"Links"]
[]
[null,"Table 1 -","FPNC provided to clients in a Care Home or provide at home, 2007-08 to 2016-17",{"$nulls":6},"Ü"]
{"$rows_left_out":15}
{"sheet":"Background notes","index":3,"n_rows":109,"n_cols":2,"rows_kept":109}
[null,"Background information"]
[]
[null,"Data Sources"]
[]
[null,"A variety of different data sources were used to compile this Statistics Release, as detailed below:"]
[]
[null,"Community Care Quarterly key monitoring return"]
[null,"Since July 2002, the Scottish Executive - followed by the Scottish Government - has collected quarterly information on the number of people receiving personal care services at home and the number of self-funders receiving free personal care and free nursing care payments.  The numbers represent only those people receiving FPC and FNC under the Community Care and Health (Scotland) Act 2002.  "]
{"$rows_left_out":102}
{"sheet":"Table1","index":4,"n_rows":45,"n_cols":39,"rows_kept":45,"merged":[[16,2,16,12]]}
[null,{"$f":"IF($A$6=\"Clients\",(\"Number of clients receiving FPNC in \"&A5&\", 2007-08 to 2016-17\"),IF($A$6=\"Expenditure (£thousands - including overheads)\",(\"FPNC Expenditure (including overheads) in \"&A5&\", 2007-08 to 2016-17\"),(\"FPNC Expenditure (excluding overheads) in \"&A5&\", 2007-08 to 2016-17\")))","v":"FPNC Expenditure (excluding overheads) in Scotland, 2007-08 to 2016-17"},{"$nulls":10},"Main page"]
[]
[null,null,"Select Local Authority:",null,null,"Select client or expenditure data:",{"$nulls":6},"Background notes"]
[]
["Scotland"," "]
["Expenditure (£thousands - excluding overheads)"," ",{"$nulls":6},{"$f":"IF(A6=\"Expenditure\",\"£000's\",\"\")","v":""},{"$nulls":20},"07-08","08-09","09-10","10-11","11-12","12-13","13-14","14-15","15-16","16-17"]
[{"$nulls":3},"2007-08","2008-09","2009-10","2010-11","2011-12","2012-13","2013-14","2014-15","2015-16","2016-17",{"$nulls":16},"2007-08","2008-09","2009-10","2010-11","2011-12","2012-13","2013-14","2014-15","2015-16","2016-17"]
[{"$f":"IF($A$6=\"Clients\",5,IF($A$6=\"Expenditure (£thousands - including overheads)\",14,19))","v":19},null,"Self-funders clients receiving FPNC in a Care Homes",{"$f":"VLOOKUP($A$5&D$7,Data!$B$4:$V$333,$A8,FALSE)","v":{"v":93748,"d":"93,748"}},{"$f":"VLOOKUP($A$5&E$7,Data!$B$4:$V$333,$A8,FALSE)","v":{"v":94166,"d":"94,166"}},{"$f":"VLOOKUP($A$5&F$7,Data!$B$4:$V$333,$A8,FALSE)","v":{"v":94803,"d":"94,803"}},{"$f":"VLOOKUP($A$5&G$7,Data!$B$4:$V$333,$A8,FALSE)","v":{"v":95628,"d":"95,628"}},{"$f":"VLOOKUP($A$5&H$7,Data!$B$4:$V$333,$A8,FALSE)","v":{"v":99209,"d":"99,209"}},{"$f":"VLOOKUP($A$5&I$7,Data!$B$4:$V$333,$A8,FALSE)","v":{"v":106659,"d":"106,659"}},{"$f":"VLOOKUP($A$5&J$7,Data!$B$4:$V$333,$A8,FALSE)","v":{"v":109275,"d":"109,275"}},{"$f":"VLOOKUP($A$5&K$7,Data!$B$4:$V$333,$A8,FALSE)","v":{"v":112870,"d":"112,870"}},{"$f":"VLOOKUP($A$5&L$7,Data!$B$4:$V$333,$A8,FALSE)","v":{"v":112173,"d":"112,173"}},{"$f":"VLOOKUP($A$5&M$7,Data!$B$4:$V$333,$A8,FALSE)","v":{"v":109200,"d":"109,200"}},{"$nulls":15},"Self-funders clients receiving FPNC in a Care Homes",{"$f":"D8","v":{"v":93748,"d":"93,748"}},{"v":94166,"d":"94,166"},{"v":94803,"d":"94,803"},{"v":95628,"d":"95,628"},{"v":99209,"d":"99,209"},{"v":106659,"d":"106,659"},{"v":109275,"d":"109,275"},{"v":112870,"d":"112,870"},{"v":112173,"d":"112,173"},{"v":109200,"d":"109,200"}]
{"$rows_left_out":17}
{"sheet":"Table2","index":5,"n_rows":43,"n_cols":40,"rows_kept":43,"merged":[[16,2,16,12]]}
[null,{"$f":"IF($A$6=\"Clients\",(\"Number of self-funders within Care Homes receiving FPNC in \"& A5&\", 2007-08 to 2016-17\"),(\"Expenditure in Care Homes on FPNC in \"& A5&\", 2007-08 to 2016-17\"))","v":"Number of self-funders within Care Homes receiving FPNC in Scotland, 2007-08 to 2016-17"},{"$nulls":10},"Main page"]
[]
[null,null,"Select Local Authority:",null,null,"Select client or expenditure data:",{"$nulls":6},"Background notes"]
[]
["Scotland"," "]
["Clients"," ",{"$nulls":6},{"$f":"IF(A6=\"Expenditure\",\"£000's\",\"\")","v":""},{"$nulls":21},"07-08","08-09","09-10","10-11","11-12","12-13","13-14","14-15","15-16","16-17"]
[{"$nulls":3},"2007-08","2008-09","2009-10","2010-11","2011-12","2012-13","2013-14","2014-15","2015-16","2016-17",{"$nulls":17},"2007-08","2008-09","2009-10","2010-11","2011-12","2012-13","2013-14","2014-15","2015-16","2016-17"]
[{"$f":"IF($A$6=\"Clients\",4,11)","v":4},null,"Long-stay residents aged 65+ supported in care homes",{"$f":"VLOOKUP($A$5&D$7,Data!$B$4:$V$333,$A8,FALSE)","v":{"v":31730,"d":"31,730"}},{"$f":"VLOOKUP($A$5&E$7,Data!$B$4:$V$333,$A8,FALSE)","v":{"v":31530,"d":"31,530"}},{"$f":"VLOOKUP($A$5&F$7,Data!$B$4:$V$333,$A8,FALSE)","v":{"v":31470,"d":"31,470"}},{"$f":"VLOOKUP($A$5&G$7,Data!$B$4:$V$333,$A8,FALSE)","v":{"v":31020,"d":"31,020"}},{"$f":"VLOOKUP($A$5&H$7,Data!$B$4:$V$333,$A8,FALSE)","v":{"v":30750,"d":"30,750"}},{"$f":"VLOOKUP($A$5&I$7,Data!$B$4:$V$333,$A8,FALSE)","v":{"v":30260,"d":"30,260"}},{"$f":"VLOOKUP($A$5&J$7,Data!$B$4:$V$333,$A8,FALSE)","v":{"v":30800,"d":"30,800"}},{"$f":"VLOOKUP($A$5&K$7,Data!$B$4:$V$333,$A8,FALSE)","v":{"v":30520,"d":"30,520"}},{"$f":"VLOOKUP($A$5&L$7,Data!$B$4:$V$333,$A8,FALSE)","v":{"v":30800,"d":"30,800"}},{"$f":"VLOOKUP($A$5&M$7,Data!$B$4:$V$333,$A8,FALSE)","v":{"v":30670,"d":"30,670"}},{"$nulls":16},"Long-stay residents aged 65+ supported in care homes",{"$f":"D8","v":{"v":31730,"d":"31,730"}},{"v":31530,"d":"31,530"},{"v":31470,"d":"31,470"},{"v":31020,"d":"31,020"},{"v":30750,"d":"30,750"},{"v":30260,"d":"30,260"},{"v":30800,"d":"30,800"},{"v":30520,"d":"30,520"},{"$f":"L8","v":{"v":30800,"d":"30,800"}},{"v":30670,"d":"30,670"}]
{"$rows_left_out":14}
{"sheet":"Table3","index":6,"n_rows":44,"n_cols":13,"rows_kept":44,"merged":[[43,2,43,12]]}
[null,{"$f":"IF(A6=\"Clients\",(\"Number of  \"&A5&\", 2007-08 to 2016-17\"),IF(A4=\"Long\",(\"Net expenditure on \"&A5&\", 2007-08 to 2016-17\"),(\"Expenditure on \"&A5&\", 2007-08 to 2016-17\")))","v":"Number of  Long-stay residents aged 65+ supported in Care Homes, 2007-08 to 2016-17"},{"$nulls":10},"Main page"]
[]
[null,null,"Select required data type:",{"$nulls":4},"Select client or expenditure data:",{"$nulls":4},"Background notes"]
[{"$f":"MID(A5,1,4)","v":"Long"}," "]
["Long-stay residents aged 65+ supported in Care Homes"," "]
["Clients"," "]
[{"$f":"IF(A6=\"Clients\",2,IF($A$6=\"Expenditure (£thousands - including overheads)\",3,4))","v":2},null,"Local Authority","2007-08","2008-09","2009-10","2010-11","2011-12","2012-13","2013-14","2014-15","2015-16","2016-17"]
[{"$f":"VLOOKUP(A5,Lookups!H2:K5,A7,FALSE)","v":4},null,"Aberdeen City",{"$f":"VLOOKUP($C8&D$7,Data!$B$4:$V$333,$A$8,FALSE)","v":{"v":1590,"d":"1,590"}},{"$f":"VLOOKUP($C8&E$7,Data!$B$4:$V$333,$A$8,FALSE)","v":{"v":1540,"d":"1,540"}},{"$f":"VLOOKUP($C8&F$7,Data!$B$4:$V$333,$A$8,FALSE)","v":{"v":1530,"d":"1,530"}},{"$f":"VLOOKUP($C8&G$7,Data!$B$4:$V$333,$A$8,FALSE)","v":{"v":1540,"d":"1,540"}},{"$f":"VLOOKUP($C8&H$7,Data!$B$4:$V$333,$A$8,FALSE)","v":{"v":1440,"d":"1,440"}},{"$f":"VLOOKUP($C8&I$7,Data!$B$4:$V$333,$A$8,FALSE)","v":{"v":1200,"d":"1,200"}},{"$f":"VLOOKUP($C8&J$7,Data!$B$4:$V$333,$A$8,FALSE)","v":{"v":1340,"d":"1,340"}},{"$f":"VLOOKUP($C8&K$7,Data!$B$4:$V$333,$A$8,FALSE)","v":{"v":1350,"d":"1,350"}},{"$f":"VLOOKUP($C8&L$7,Data!$B$4:$V$333,$A$8,FALSE)","v":{"v":1310,"d":"1,310"}},{"$f":"VLOOKUP($C8&M$7,Data!$B$4:$V$333,$A$8,FALSE)","v":{"v":1260,"d":"1,260"}}]
{"$rows_left_out":37}
{"sheet":"Table4","index":7,"n_rows":20,"n_cols":39,"rows_kept":20}
[null,{"$f":"IF($A$6=\"Clients\",(\"Number of clients receiving FPC at home in \"& A5&\", 2007-08 to 2016-17\"),(\"Expenditure on FPC provide at home in \"& A5&\", 2007-08 to 2016-17\"))","v":"Number of clients receiving FPC at home in Scotland, 2007-08 to 2016-17"},{"$nulls":10},"Main page"]
[]
[null,null,"Select Local Authority:",null,null,"Select client or expenditure data:",{"$nulls":6},"Background notes"]
[]
["Scotland"," "]
["Clients"," ",{"$nulls":6},{"$f":"IF(A6=\"Expenditure\",\"£000's\",\"\")","v":""},{"$nulls":20},"07-08","08-09","09-10","10-11","11-12","12-13","13-14","14-15","15-16","16-17"]
[{"$nulls":3},"2007-08","2008-09","2009-10","2010-11","2011-12","2012-13","2013-14","2014-15","2015-16","2016-17",{"$nulls":16},"2007-08","2008-09","2009-10","2010-11","2011-12","2012-13","2013-14","2014-15","2015-16","2016-17"]
[{"$f":"IF($A$6=\"Clients\",8,15)","v":8},null,{"$f":"IF($A$6=\"Clients\",\"Number of Home Care Clients aged 65+\",\"Net expenditure on Home Care for older people\")","v":"Number of Home Care Clients aged 65+"},{"$f":"VLOOKUP($A$5&D$7,Data!$B$4:$V$333,$A8,FALSE)","v":{"v":55340,"d":"55,340"}},{"$f":"VLOOKUP($A$5&E$7,Data!$B$4:$V$333,$A8,FALSE)","v":{"v":54720,"d":"54,720"}},{"$f":"VLOOKUP($A$5&F$7,Data!$B$4:$V$333,$A8,FALSE)","v":{"v":53660,"d":"53,660"}},{"$f":"VLOOKUP($A$5&G$7,Data!$B$4:$V$333,$A8,FALSE)","v":{"v":51730,"d":"51,730"}},{"$f":"VLOOKUP($A$5&H$7,Data!$B$4:$V$333,$A8,FALSE)","v":{"v":51120,"d":"51,120"}},{"$f":"VLOOKUP($A$5&I$7,Data!$B$4:$V$333,$A8,FALSE)","v":{"v":50370,"d":"50,370"}},{"$f":"VLOOKUP($A$5&J$7,Data!$B$4:$V$333,$A8,FALSE)","v":{"v":50450,"d":"50,450"}},{"$f":"VLOOKUP($A$5&K$7,Data!$B$4:$V$333,$A8,FALSE)","v":{"v":50160,"d":"50,160"}},{"$f":"VLOOKUP($A$5&L$7,Data!$B$4:$V$333,$A8,FALSE)","v":{"v":49430,"d":"49,430"}},{"$f":"VLOOKUP($A$5&M$7,Data!$B$4:$V$333,$A8,FALSE)","v":{"v":48810,"d":"48,810"}},{"$nulls":15},{"$f":"C8","v":"Number of Home Care Clients aged 65+"},{"$f":"D8","v":55340},54720,53660,51730,51120,50370,50450,50160,49430,48810]
{"$rows_left_out":13}
{"sheet":"Table5","index":8,"n_rows":44,"n_cols":13,"rows_kept":44}
[null,{"$f":"IF(A6=\"Clients\",(\"Number of \"&A5&\", 2007-08 to 2016-17\"),(\"Expenditure on \"&A5&\", 2007-08 to 2016-17\"))","v":"Number of Clients aged 65+ receiving FPC at home, 2007-08 to 2016-17"},{"$nulls":10},"Main page"]
[]
[null,null,"Select required data type:",{"$nulls":4},"Select client or expenditure data:",{"$nulls":4},"Background notes"]
[]
["Clients aged 65+ receiving FPC at home"," "]
["Clients"," "]
[{"$f":"IF(A6=\"Clients\",2,IF($A$6=\"Expenditure (£thousands - including overheads)\",3,4))","v":2},null,"Local Authority","2007-08","2008-09","2009-10","2010-11","2011-12","2012-13","2013-14","2014-15","2015-16","2016-17"]
[{"$f":"VLOOKUP(A5,Lookups!H8:K10,A7,FALSE)","v":9},null,"Aberdeen City",{"$f":"IF($A$11=1,\"NA\",VLOOKUP($C8&D$7,Data!$B$4:$V$333,$A$8,FALSE))","v":{"v":1810,"d":"1,810"}},{"$f":"IF($A$11=1,\"NA\",VLOOKUP($C8&E$7,Data!$B$4:$V$333,$A$8,FALSE))","v":{"v":1620,"d":"1,620"}},{"$f":"IF($A$11=1,\"NA\",VLOOKUP($C8&F$7,Data!$B$4:$V$333,$A$8,FALSE))","v":{"v":1710,"d":"1,710"}},{"$f":"IF($A$11=1,\"NA\",VLOOKUP($C8&G$7,Data!$B$4:$V$333,$A$8,FALSE))","v":{"v":1740,"d":"1,740"}},{"$f":"IF($A$11=1,\"NA\",VLOOKUP($C8&H$7,Data!$B$4:$V$333,$A$8,FALSE))","v":{"v":1780,"d":"1,780"}},{"$f":"IF($A$11=1,\"NA\",VLOOKUP($C8&I$7,Data!$B$4:$V$333,$A$8,FALSE))","v":{"v":1610,"d":"1,610"}},{"$f":"IF($A$11=1,\"NA\",VLOOKUP($C8&J$7,Data!$B$4:$V$333,$A$8,FALSE))","v":{"v":1560,"d":"1,560"}},{"$f":"IF($A$11=1,\"NA\",VLOOKUP($C8&K$7,Data!$B$4:$V$333,$A$8,FALSE))","v":{"v":1490,"d":"1,490"}},{"$f":"IF($A$11=1,\"NA\",VLOOKUP($C8&L$7,Data!$B$4:$V$333,$A$8,FALSE))","v":{"v":1560,"d":"1,560"}},{"$f":"IF($A$11=1,\"NA\",VLOOKUP($C8&M$7,Data!$B$4:$V$333,$A$8,FALSE))","v":{"v":1500,"d":"1,500"}}]
{"$rows_left_out":36}