{"text_format":"3","workbook":"xlsx","n_sheets":9,"sheets":["Data","Lookups","Main","Background notes","Table1","Table2","Table3","Table4","Table5"],"not_rendered":{"charts":6,"images":10,"macros":1,"defined_names":9},"read":"whole","date_system":"1900"}

{"sheet":"Data","index":0,"n_rows":333,"n_cols":22,"rows_kept":333,"hidden":true,"merged":[[1,4,1,10],[1,11,1,16],[1,17,1,20],[1,21,2,21]]}
[null,1,2,3,4,5,6,7,8,9,10,11,12,13,14,15,16,17,18,19,20,21]
[{"$nulls":4},"Clients",{"$nulls":6},"Expenditure",{"$nulls":5},"Expenditure withOUT overheads",{"$nulls":3},"65+ Pops"]
[null,null,"Local Authority","Year","LS 65+ CH","CH_ALL","CH_FPC","CH_FNC","HC - 65+","HC_FPC","HC_AvHrs","CareHomes","CH_FPC","CH_FNC","CH_FPNC","Homecare","HC_FPC","CH_FPC","CH_FNC","CH_FPNC","HC_FPC"]
[null,{"$f":"C4&D4","v":"Aberdeen City2007-08"},"Aberdeen City","2007-08",1590,510,500,360,{"v":1980,"d":"1,980"},{"v":1810,"d":"1,810"},{"v":13800,"d":"13,800"},{"v":27098,"d":"27,098"},{"v":3381,"d":"3,381"},{"v":1187,"d":"1,187"},{"v":4568,"d":"4,568"},{"v":13303,"d":"13,303"},{"v":9912,"d":"9,912"},{"v":3268,"d":"3,268"},{"v":1148,"d":"1,148"},{"v":4416,"d":"4,416"},{"v":9502,"d":"9,502"},{"v":32165,"d":"32,165"}]
[null,"Aberdeenshire2007-08","Aberdeenshire","2007-08",1360,470,460,350,{"v":2100,"d":"2,100"},{"v":1920,"d":"1,920"},{"v":11300,"d":"11,300"},{"v":23567,"d":"23,567"},{"v":3873,"d":"3,873"},{"v":1302,"d":"1,302"},{"v":5175,"d":"5,175"},{"v":12133,"d":"12,133"},{"v":10857,"d":"10,857"},{"v":3604,"d":"3,604"},{"v":1212,"d":"1,212"},{"v":4816,"d":"4,816"},{"v":10105,"d":"10,105"},{"v":37339,"d":"37,339"}]
[null,"Angus2007-08","Angus","2007-08",680,300,300,120,{"v":1610,"d":"1,610"},810,{"v":3300,"d":"3,300"},{"v":14749,"d":"14,749"},{"v":2158,"d":"2,158"},384,{"v":2542,"d":"2,542"},{"v":6994,"d":"6,994"},{"v":2483,"d":"2,483"},{"v":2043,"d":"2,043"},364,{"v":2407,"d":"2,407"},{"v":2351,"d":"2,351"},{"v":21312,"d":"21,312"}]
[null,"Argyll & Bute2007-08","Argyll & Bute","2007-08",790,220,220,70,740,560,{"v":5300,"d":"5,300"},{"v":12578,"d":"12,578"},{"v":1926,"d":"1,926"},260,{"v":2186,"d":"2,186"},{"v":7359,"d":"7,359"},{"v":6397,"d":"6,397"},{"v":1673,"d":"1,673"},225,{"v":1898,"d":"1,898"},{"v":5473,"d":"5,473"},{"v":18267,"d":"18,267"}]
[null,"Clackmannanshire2007-08","Clackmannanshire","2007-08",250,50,50,40,590,500,{"v":3900,"d":"3,900"},{"v":3857,"d":"3,857"},399,151,550,{"v":1786,"d":"1,786"},{"v":2478,"d":"2,478"},369,140,509,{"v":2294,"d":"2,294"},{"v":7533,"d":"7,533"}]
[null,"Dumfries & Galloway2007-08","Dumfries & Galloway","2007-08",870,320,320,240,{"v":1710,"d":"1,710"},{"v":1500,"d":"1,500"},{"v":11500,"d":"11,500"},{"v":10332,"d":"10,332"},{"v":2160,"d":"2,160"},671,{"v":2831,"d":"2,831"},{"v":12972,"d":"12,972"},{"v":10684,"d":"10,684"},{"v":1988,"d":"1,988"},617,{"v":2605,"d":"2,605"},{"v":9829,"d":"9,829"},{"v":31016,"d":"31,016"}]
[null,"Dundee City2007-08","Dundee City","2007-08",880,240,230,120,{"v":1920,"d":"1,920"},830,{"v":6200,"d":"6,200"},{"v":16817,"d":"16,817"},{"v":1866,"d":"1,866"},438,{"v":2304,"d":"2,304"},{"v":11078,"d":"11,078"},{"v":7440,"d":"7,440"},{"v":1770,"d":"1,770"},416,{"v":2186,"d":"2,186"},{"v":6678,"d":"6,678"},{"v":25239,"d":"25,239"}]
[null,"East Ayrshire2007-08","East Ayrshire","2007-08",690,180,180,130,{"v":1590,"d":"1,590"},{"v":1400,"d":"1,400"},{"v":11800,"d":"11,800"},{"v":12379,"d":"12,379"},{"v":1393,"d":"1,393"},455,{"v":1848,"d":"1,848"},{"v":9612,"d":"9,612"},{"v":8702,"d":"8,702"},{"v":1282,"d":"1,282"},418,{"v":1700,"d":"1,700"},{"v":6766,"d":"6,766"},{"v":20125,"d":"20,125"}]
[null,"East Dunbartonshire2007-08","East Dunbartonshire","2007-08",560,300,300,230,{"v":1070,"d":"1,070"},860,{"v":5500,"d":"5,500"},{"v":5146,"d":"5,146"},{"v":2703,"d":"2,703"},973,{"v":3676,"d":"3,676"},{"v":7632,"d":"7,632"},{"v":4166,"d":"4,166"},{"v":2455,"d":"2,455"},884,{"v":3339,"d":"3,339"},{"v":3677,"d":"3,677"},{"v":18833,"d":"18,833"}]
[null,"East Lothian2007-08","East Lothian","2007-08",590,180,170,140,{"v":1110,"d":"1,110"},900,{"v":7700,"d":"7,700"},{"v":9676,"d":"9,676"},{"v":1411,"d":"1,411"},502,{"v":1913,"d":"1,913"},{"v":5728,"d":"5,728"},{"v":6628,"d":"6,628"},{"v":1293,"d":"1,293"},460,{"v":1753,"d":"1,753"},{"v":6024,"d":"6,024"},{"v":16661,"d":"16,661"}]
[null,"East Renfrewshire2007-08","East Renfrewshire","2007-08",530,250,250,180,830,670,{"v":4700,"d":"4,700"},{"v":5843,"d":"5,843"},{"v":2015,"d":"2,015"},598,{"v":2613,"d":"2,613"},{"v":5144,"d":"5,144"},{"v":4178,"d":"4,178"},{"v":1951,"d":"1,951"},579,{"v":2530,"d":"2,530"},{"v":4045,"d":"4,045"},{"v":15377,"d":"15,377"}]
[null,"Edinburgh, City of2007-08","Edinburgh, City of","2007-08",2950,1390,{"v":1370,"d":"1,370"},{"v":1000,"d":"1,000"},{"v":3810,"d":"3,810"},{"v":2950,"d":"2,950"},{"v":26100,"d":"26,100"},{"v":58348,"d":"58,348"},{"v":13083,"d":"13,083"},{"v":4138,"d":"4,138"},{"v":17221,"d":"17,221"},{"v":31515,"d":"31,515"},{"v":28330,"d":"28,330"},{"v":12037,"d":"12,037"},{"v":3807,"d":"3,807"},{"v":15844,"d":"15,844"},{"v":26064,"d":"26,064"},{"v":67571,"d":"67,571"}]
[null,"Eilean Siar2007-08","Eilean Siar","2007-08",190,30,30,10,500,430,{"v":3700,"d":"3,700"},{"v":5881,"d":"5,881"},182,38,220,{"v":4221,"d":"4,221"},{"v":3394,"d":"3,394"},158,33,191,{"v":2715,"d":"2,715"},{"v":5548,"d":"5,548"}]
[null,"Falkirk2007-08","Falkirk","2007-08",740,150,150,130,{"v":1780,"d":"1,780"},{"v":1250,"d":"1,250"},{"v":7700,"d":"7,700"},{"v":12084,"d":"12,084"},{"v":1356,"d":"1,356"},511,{"v":1867,"d":"1,867"},{"v":11095,"d":"11,095"},{"v":5394,"d":"5,394"},{"v":1279,"d":"1,279"},482,{"v":1761,"d":"1,761"},{"v":5089,"d":"5,089"},{"v":23880,"d":"23,880"}]
[null,"Fife2007-08","Fife","2007-08",2190,750,750,400,{"v":5060,"d":"5,060"},{"v":3180,"d":"3,180"},{"v":16600,"d":"16,600"},{"v":34707,"d":"34,707"},{"v":6003,"d":"6,003"},{"v":1460,"d":"1,460"},{"v":7463,"d":"7,463"},{"v":18680,"d":"18,680"},{"v":13893,"d":"13,893"},{"v":5433,"d":"5,433"},{"v":1321,"d":"1,321"},{"v":6754,"d":"6,754"},{"v":12087,"d":"12,087"},{"v":60068,"d":"60,068"}]
[null,"Glasgow City2007-08","Glasgow City","2007-08",4430,690,680,410,{"v":6990,"d":"6,990"},{"v":5270,"d":"5,270"},{"v":35400,"d":"35,400"},{"v":74439,"d":"74,439"},{"v":6494,"d":"6,494"},{"v":1531,"d":"1,531"},{"v":8025,"d":"8,025"},{"v":48035,"d":"48,035"},{"v":44348,"d":"44,348"},{"v":4506,"d":"4,506"},{"v":1290,"d":"1,290"},{"v":5796,"d":"5,796"},{"v":40294,"d":"40,294"},{"v":83851,"d":"83,851"}]
[null,"Highland2007-08","Highland","2007-08",1440,430,420,130,{"v":1840,"d":"1,840"},{"v":1480,"d":"1,480"},{"v":8600,"d":"8,600"},{"v":25185,"d":"25,185"},{"v":4038,"d":"4,038"},564,{"v":4602,"d":"4,602"},{"v":12798,"d":"12,798"},{"v":8335,"d":"8,335"},{"v":3197,"d":"3,197"},446,{"v":3643,"d":"3,643"},{"v":6613,"d":"6,613"},{"v":39182,"d":"39,182"}]
[null,"Inverclyde2007-08","Inverclyde","2007-08",580,170,170,140,{"v":1120,"d":"1,120"},{"v":1070,"d":"1,070"},{"v":8900,"d":"8,900"},{"v":10864,"d":"10,864"},{"v":1395,"d":"1,395"},501,{"v":1896,"d":"1,896"},{"v":6786,"d":"6,786"},{"v":5534,"d":"5,534"},{"v":1290,"d":"1,290"},463,{"v":1753,"d":"1,753"},{"v":4898,"d":"4,898"},{"v":14254,"d":"14,254"}]
[null,"Midlothian2007-08","Midlothian","2007-08",490,100,100,70,850,550,{"v":4400,"d":"4,400"},{"v":7947,"d":"7,947"},819,267,{"v":1086,"d":"1,086"},{"v":4566,"d":"4,566"},{"v":3749,"d":"3,749"},750,245,995,{"v":3408,"d":"3,408"},{"v":12782,"d":"12,782"}]
[null,"Moray2007-08","Moray","2007-08",480,180,180,130,{"v":1120,"d":"1,120"},760,{"v":5400,"d":"5,400"},{"v":7399,"d":"7,399"},{"v":1493,"d":"1,493"},499,{"v":1992,"d":"1,992"},{"v":6058,"d":"6,058"},{"v":5500,"d":"5,500"},{"v":1285,"d":"1,285"},430,{"v":1715,"d":"1,715"},{"v":4735,"d":"4,735"},{"v":15741,"d":"15,741"}]
[null,"North Ayrshire2007-08","North Ayrshire","2007-08",800,260,260,170,{"v":1380,"d":"1,380"},{"v":1230,"d":"1,230"},{"v":5700,"d":"5,700"},{"v":15751,"d":"15,751"},{"v":2213,"d":"2,213"},642,{"v":2855,"d":"2,855"},{"v":4356,"d":"4,356"},{"v":4952,"d":"4,952"},{"v":1973,"d":"1,973"},573,{"v":2546,"d":"2,546"},{"v":4417,"d":"4,417"},{"v":24077,"d":"24,077"}]
[null,"North Lanarkshire2007-08","North Lanarkshire","2007-08",1450,210,210,160,{"v":3200,"d":"3,200"},{"v":2320,"d":"2,320"},{"v":17700,"d":"17,700"},{"v":30571,"d":"30,571"},{"v":1685,"d":"1,685"},575,{"v":2260,"d":"2,260"},{"v":24003,"d":"24,003"},{"v":12381,"d":"12,381"},{"v":1560,"d":"1,560"},532,{"v":2092,"d":"2,092"},{"v":9781,"d":"9,781"},{"v":47640,"d":"47,640"}]
[null,"Orkney Islands2007-08","Orkney Islands","2007-08",100,30,30,0,250,170,{"v":1000,"d":"1,000"},{"v":3339,"d":"3,339"},250,7,257,{"v":1145,"d":"1,145"},759,231,6,237,703,{"v":3789,"d":"3,789"}]
[null,"Perth & Kinross2007-08","Perth & Kinross","2007-08",1060,430,420,190,{"v":1080,"d":"1,080"},{"v":1000,"d":"1,000"},{"v":7300,"d":"7,300"},{"v":17464,"d":"17,464"},{"v":4057,"d":"4,057"},937,{"v":4994,"d":"4,994"},{"v":9869,"d":"9,869"},{"v":7033,"d":"7,033"},{"v":3834,"d":"3,834"},885,{"v":4719,"d":"4,719"},{"v":6314,"d":"6,314"},{"v":27401,"d":"27,401"}]
[null,"Renfrewshire2007-08","Renfrewshire","2007-08",1060,240,240,190,{"v":1490,"d":"1,490"},{"v":1110,"d":"1,110"},{"v":5800,"d":"5,800"},{"v":17670,"d":"17,670"},{"v":1935,"d":"1,935"},679,{"v":2614,"d":"2,614"},{"v":6176,"d":"6,176"},{"v":3833,"d":"3,833"},{"v":1773,"d":"1,773"},622,{"v":2395,"d":"2,395"},{"v":3383,"d":"3,383"},{"v":27887,"d":"27,887"}]
[null,"Scottish Borders2007-08","Scottish Borders","2007-08",720,260,260,110,{"v":1100,"d":"1,100"},{"v":1040,"d":"1,040"},{"v":5700,"d":"5,700"},{"v":11437,"d":"11,437"},{"v":2273,"d":"2,273"},422,{"v":2695,"d":"2,695"},{"v":6407,"d":"6,407"},{"v":4561,"d":"4,561"},{"v":2021,"d":"2,021"},375,{"v":2396,"d":"2,396"},{"v":4055,"d":"4,055"},{"v":21925,"d":"21,925"}]
[null,"Shetland Islands2007-08","Shetland Islands","2007-08",110,0,0,0,400,210,{"v":1900,"d":"1,900"},{"v":4170,"d":"4,170"},0,0,0,{"v":1886,"d":"1,886"},{"v":1797,"d":"1,797"},0,0,0,{"v":1633,"d":"1,633"},{"v":3455,"d":"3,455"}]
[null,"South Ayrshire2007-08","South Ayrshire","2007-08",810,360,360,280,{"v":1560,"d":"1,560"},{"v":1440,"d":"1,440"},{"v":14000,"d":"14,000"},{"v":14799,"d":"14,799"},{"v":2987,"d":"2,987"},{"v":1056,"d":"1,056"},{"v":4043,"d":"4,043"},{"v":9391,"d":"9,391"},{"v":11142,"d":"11,142"},{"v":2797,"d":"2,797"},989,{"v":3786,"d":"3,786"},{"v":9523,"d":"9,523"},{"v":22834,"d":"22,834"}]
[null,"South Lanarkshire2007-08","South Lanarkshire","2007-08",1680,480,470,330,{"v":2990,"d":"2,990"},{"v":2600,"d":"2,600"},{"v":23400,"d":"23,400"},{"v":30758,"d":"30,758"},{"v":3822,"d":"3,822"},{"v":1222,"d":"1,222"},{"v":5044,"d":"5,044"},{"v":20628,"d":"20,628"},{"v":15416,"d":"15,416"},{"v":3434,"d":"3,434"},{"v":1097,"d":"1,097"},{"v":4531,"d":"4,531"},{"v":13796,"d":"13,796"},{"v":49806,"d":"49,806"}]
[null,"Stirling2007-08","Stirling","2007-08",520,210,210,140,800,450,{"v":2200,"d":"2,200"},{"v":9196,"d":"9,196"},{"v":1937,"d":"1,937"},645,{"v":2582,"d":"2,582"},{"v":5216,"d":"5,216"},{"v":3163,"d":"3,163"},{"v":1754,"d":"1,754"},583,{"v":2337,"d":"2,337"},{"v":2857,"d":"2,857"},{"v":14491,"d":"14,491"}]
[null,{"$f":"C34&D34","v":"West Dunbartonshire2007-08"},"West Dunbartonshire","2007-08",510,90,90,40,{"v":1610,"d":"1,610"},{"v":1010,"d":"1,010"},{"v":7000,"d":"7,000"},{"v":10268,"d":"10,268"},692,164,856,{"v":1333,"d":"1,333"},{"v":4753,"d":"4,753"},641,152,793,{"v":4401,"d":"4,401"},{"v":14625,"d":"14,625"}]
[null,"West Lothian2007-08","West Lothian","2007-08",630,130,130,110,{"v":1190,"d":"1,190"},{"v":1000,"d":"1,000"},{"v":6000,"d":"6,000"},{"v":11969,"d":"11,969"},{"v":1024,"d":"1,024"},412,{"v":1436,"d":"1,436"},{"v":7557,"d":"7,557"},{"v":5268,"d":"5,268"},931,374,{"v":1305,"d":"1,305"},{"v":4650,"d":"4,650"},{"v":21331,"d":"21,331"}]
[null,"Scotland2007-08","Scotland","2007-08",31730,9590,{"v":9510,"d":"9,510"},{"v":6130,"d":"6,130"},{"v":55340,"d":"55,340"},{"v":42260,"d":"42,260"},{"v":299400,"d":"299,400"},{"v":556288,"d":"556,288"},{"v":81023,"d":"81,023"},{"v":23191,"d":"23,191"},{"v":104214,"d":"104,214"},{"v":335462,"d":"335,462"},{"v":267460,"d":"267,460"},{"v":72580,"d":"72,580"},{"v":21168,"d":"21,168"},{"v":93748,"d":"93,748"},{"v":238160,"d":"238,160"},{"v":846005,"d":"846,005"}]
[null,"Aberdeen City2008-09","Aberdeen City","2008-09",1540,460,450,320,{"v":1610,"d":"1,610"},{"v":1620,"d":"1,620"},{"v":12300,"d":"12,300"},{"v":26002,"d":"26,002"},{"v":3314,"d":"3,314"},{"v":1081,"d":"1,081"},{"v":4395,"d":"4,395"},{"v":13816,"d":"13,816"},{"v":9475,"d":"9,475"},{"v":3184,"d":"3,184"},{"v":1039,"d":"1,039"},{"v":4223,"d":"4,223"},{"v":9013,"d":"9,013"},{"v":32096,"d":"32,096"}]
[null,"Aberdeenshire2008-09","Aberdeenshire","2008-09",1380,490,490,360,{"v":2200,"d":"2,200"},{"v":2000,"d":"2,000"},{"v":12100,"d":"12,100"},{"v":24196,"d":"24,196"},{"v":4329,"d":"4,329"},{"v":1415,"d":"1,415"},{"v":5744,"d":"5,744"},{"v":13577,"d":"13,577"},{"v":11060,"d":"11,060"},{"v":4043,"d":"4,043"},{"v":1321,"d":"1,321"},{"v":5364,"d":"5,364"},{"v":10329,"d":"10,329"},{"v":38307,"d":"38,307"}]
[null,"Angus2008-09","Angus","2008-09",620,320,320,140,{"v":1580,"d":"1,580"},820,{"v":3300,"d":"3,300"},{"v":15375,"d":"15,375"},{"v":2311,"d":"2,311"},397,{"v":2708,"d":"2,708"},{"v":7003,"d":"7,003"},{"v":2652,"d":"2,652"},{"v":2062,"d":"2,062"},354,{"v":2416,"d":"2,416"},{"v":2366,"d":"2,366"},{"v":21817,"d":"21,817"}]
[null,"Argyll & Bute2008-09","Argyll & Bute","2008-09",770,220,220,70,690,640,{"v":6500,"d":"6,500"},{"v":13106,"d":"13,106"},{"v":1596,"d":"1,596"},383,{"v":1979,"d":"1,979"},{"v":8056,"d":"8,056"},{"v":6918,"d":"6,918"},{"v":1467,"d":"1,467"},352,{"v":1819,"d":"1,819"},{"v":6342,"d":"6,342"},{"v":18527,"d":"18,527"}]
[null,"Clackmannanshire2008-09","Clackmannanshire","2008-09",240,60,60,50,580,510,{"v":3500,"d":"3,500"},{"v":4180,"d":"4,180"},475,192,667,{"v":2822,"d":"2,822"},{"v":2082,"d":"2,082"},441,178,619,{"v":1928,"d":"1,928"},{"v":7679,"d":"7,679"}]
[null,"Dumfries & Galloway2008-09","Dumfries & Galloway","2008-09",900,360,360,290,{"v":1680,"d":"1,680"},{"v":1730,"d":"1,730"},{"v":17900,"d":"17,900"},{"v":10219,"d":"10,219"},{"v":2698,"d":"2,698"},967,{"v":3665,"d":"3,665"},{"v":14268,"d":"14,268"},{"v":10600,"d":"10,600"},{"v":2482,"d":"2,482"},890,{"v":3372,"d":"3,372"},{"v":9752,"d":"9,752"},{"v":31669,"d":"31,669"}]
[null,"Dundee City2008-09","Dundee City","2008-09",960,250,250,130,{"v":1960,"d":"1,960"},890,{"v":6800,"d":"6,800"},{"v":18039,"d":"18,039"},{"v":2194,"d":"2,194"},554,{"v":2748,"d":"2,748"},{"v":12323,"d":"12,323"},{"v":6828,"d":"6,828"},{"v":2081,"d":"2,081"},526,{"v":2607,"d":"2,607"},{"v":6156,"d":"6,156"},{"v":25085,"d":"25,085"}]
[null,"East Ayrshire2008-09","East Ayrshire","2008-09",700,180,180,130,{"v":1590,"d":"1,590"},{"v":1500,"d":"1,500"},{"v":12200,"d":"12,200"},{"v":14150,"d":"14,150"},{"v":1499,"d":"1,499"},486,{"v":1985,"d":"1,985"},{"v":11377,"d":"11,377"},{"v":8792,"d":"8,792"},{"v":1379,"d":"1,379"},447,{"v":1826,"d":"1,826"},{"v":6832,"d":"6,832"},{"v":20395,"d":"20,395"}]
[null,"East Dunbartonshire2008-09","East Dunbartonshire","2008-09",590,320,320,250,{"v":1090,"d":"1,090"},900,{"v":5500,"d":"5,500"},{"v":5175,"d":"5,175"},{"v":2700,"d":"2,700"},976,{"v":3676,"d":"3,676"},{"v":8400,"d":"8,400"},{"v":5134,"d":"5,134"},{"v":2453,"d":"2,453"},886,{"v":3339,"d":"3,339"},{"v":4532,"d":"4,532"},{"v":19223,"d":"19,223"}]
[null,"East Lothian2008-09","East Lothian","2008-09",570,160,150,120,{"v":1090,"d":"1,090"},910,{"v":7700,"d":"7,700"},{"v":11536,"d":"11,536"},{"v":1572,"d":"1,572"},587,{"v":2159,"d":"2,159"},{"v":7976,"d":"7,976"},{"v":8175,"d":"8,175"},{"v":1440,"d":"1,440"},538,{"v":1978,"d":"1,978"},{"v":7430,"d":"7,430"},{"v":16921,"d":"16,921"}]
[null,"East Renfrewshire2008-09","East Renfrewshire","2008-09",530,260,260,170,830,690,{"v":5000,"d":"5,000"},{"v":8872,"d":"8,872"},{"v":1934,"d":"1,934"},710,{"v":2644,"d":"2,644"},{"v":5313,"d":"5,313"},{"v":4419,"d":"4,419"},{"v":1867,"d":"1,867"},685,{"v":2552,"d":"2,552"},{"v":4265,"d":"4,265"},{"v":15595,"d":"15,595"}]
[null,"Edinburgh, City of2008-09","Edinburgh, City of","2008-09",2840,1380,{"v":1370,"d":"1,370"},{"v":1000,"d":"1,000"},{"v":3760,"d":"3,760"},{"v":2930,"d":"2,930"},{"v":25000,"d":"25,000"},{"v":58400,"d":"58,400"},{"v":10920,"d":"10,920"},{"v":3540,"d":"3,540"},{"v":14460,"d":"14,460"},{"v":29078,"d":"29,078"},{"v":22836,"d":"22,836"},{"v":10047,"d":"10,047"},{"v":3256,"d":"3,256"},{"v":13303,"d":"13,303"},{"v":21009,"d":"21,009"},{"v":67695,"d":"67,695"}]
[null,"Eilean Siar2008-09","Eilean Siar","2008-09",190,30,30,10,490,450,{"v":3800,"d":"3,800"},{"v":6446,"d":"6,446"},286,74,360,{"v":4696,"d":"4,696"},{"v":3939,"d":"3,939"},249,64,313,{"v":3151,"d":"3,151"},{"v":5675,"d":"5,675"}]
[null,"Falkirk2008-09","Falkirk","2008-09",760,150,150,140,{"v":1820,"d":"1,820"},{"v":1340,"d":"1,340"},{"v":8800,"d":"8,800"},{"v":12868,"d":"12,868"},{"v":1484,"d":"1,484"},575,{"v":2059,"d":"2,059"},{"v":12677,"d":"12,677"},{"v":7764,"d":"7,764"},{"v":1400,"d":"1,400"},542,{"v":1942,"d":"1,942"},{"v":7325,"d":"7,325"},{"v":24272,"d":"24,272"}]
[null,"Fife2008-09","Fife","2008-09",2130,740,730,370,{"v":4590,"d":"4,590"},{"v":3430,"d":"3,430"},{"v":18600,"d":"18,600"},{"v":36066,"d":"36,066"},{"v":5978,"d":"5,978"},{"v":1420,"d":"1,420"},{"v":7398,"d":"7,398"},{"v":19605,"d":"19,605"},{"v":17463,"d":"17,463"},{"v":5410,"d":"5,410"},{"v":1285,"d":"1,285"},{"v":6695,"d":"6,695"},{"v":15193,"d":"15,193"},{"v":61067,"d":"61,067"}]
[null,"Glasgow City2008-09","Glasgow City","2008-09",4300,700,690,420,{"v":6950,"d":"6,950"},{"v":5150,"d":"5,150"},{"v":41700,"d":"41,700"},{"v":82676,"d":"82,676"},{"v":8969,"d":"8,969"},{"v":1751,"d":"1,751"},{"v":10720,"d":"10,720"},{"v":53124,"d":"53,124"},{"v":40150,"d":"40,150"},{"v":5500,"d":"5,500"},{"v":1476,"d":"1,476"},{"v":6976,"d":"6,976"},{"v":36480,"d":"36,480"},{"v":83255,"d":"83,255"}]
[null,"Highland2008-09","Highland","2008-09",1450,400,400,110,{"v":1840,"d":"1,840"},{"v":1710,"d":"1,710"},{"v":9300,"d":"9,300"},{"v":25858,"d":"25,858"},{"v":3571,"d":"3,571"},452,{"v":4023,"d":"4,023"},{"v":13140,"d":"13,140"},{"v":8963,"d":"8,963"},{"v":3020,"d":"3,020"},382,{"v":3402,"d":"3,402"},{"v":7579,"d":"7,579"},{"v":40335,"d":"40,335"}]
[null,"Inverclyde2008-09","Inverclyde","2008-09",600,170,170,140,{"v":1140,"d":"1,140"},{"v":1170,"d":"1,170"},{"v":12800,"d":"12,800"},{"v":11426,"d":"11,426"},{"v":1409,"d":"1,409"},517,{"v":1926,"d":"1,926"},{"v":7826,"d":"7,826"},{"v":5819,"d":"5,819"},{"v":1303,"d":"1,303"},478,{"v":1781,"d":"1,781"},{"v":5150,"d":"5,150"},{"v":14384,"d":"14,384"}]
[null,"Midlothian2008-09","Midlothian","2008-09",460,90,90,70,820,640,{"v":5400,"d":"5,400"},{"v":7571,"d":"7,571"},755,255,{"v":1010,"d":"1,010"},{"v":5831,"d":"5,831"},{"v":4205,"d":"4,205"},691,234,925,{"v":3822,"d":"3,822"},{"v":13027,"d":"13,027"}]
[null,"Moray2008-09","Moray","2008-09",500,190,190,120,{"v":1050,"d":"1,050"},780,{"v":5600,"d":"5,600"},{"v":7706,"d":"7,706"},{"v":1683,"d":"1,683"},487,{"v":2170,"d":"2,170"},{"v":6771,"d":"6,771"},{"v":5732,"d":"5,732"},{"v":1405,"d":"1,405"},406,{"v":1811,"d":"1,811"},{"v":4783,"d":"4,783"},{"v":16194,"d":"16,194"}]
[null,"North Ayrshire2008-09","North Ayrshire","2008-09",820,290,290,190,{"v":1490,"d":"1,490"},{"v":1410,"d":"1,410"},{"v":9800,"d":"9,800"},{"v":15968,"d":"15,968"},{"v":2378,"d":"2,378"},713,{"v":3091,"d":"3,091"},{"v":11059,"d":"11,059"},{"v":8223,"d":"8,223"},{"v":2170,"d":"2,170"},651,{"v":2821,"d":"2,821"},{"v":7505,"d":"7,505"},{"v":24529,"d":"24,529"}]
[null,"North Lanarkshire2008-09","North Lanarkshire","2008-09",1450,240,240,200,{"v":3140,"d":"3,140"},{"v":2400,"d":"2,400"},{"v":19800,"d":"19,800"},{"v":39242,"d":"39,242"},{"v":1709,"d":"1,709"},637,{"v":2346,"d":"2,346"},{"v":30518,"d":"30,518"},{"v":14103,"d":"14,103"},{"v":1582,"d":"1,582"},590,{"v":2172,"d":"2,172"},{"v":11141,"d":"11,141"},{"v":48407,"d":"48,407"}]
[null,"Orkney Islands2008-09","Orkney Islands","2008-09",110,30,30,0,240,210,{"v":1100,"d":"1,100"},{"v":4207,"d":"4,207"},267,4,271,{"v":1795,"d":"1,795"},{"v":1137,"d":"1,137"},248,3,251,{"v":1053,"d":"1,053"},{"v":3904,"d":"3,904"}]
[null,"Perth & Kinross2008-09","Perth & Kinross","2008-09",1040,430,420,200,{"v":1110,"d":"1,110"},{"v":1050,"d":"1,050"},{"v":7700,"d":"7,700"},{"v":18832,"d":"18,832"},{"v":3584,"d":"3,584"},801,{"v":4385,"d":"4,385"},{"v":10674,"d":"10,674"},{"v":7515,"d":"7,515"},{"v":3387,"d":"3,387"},757,{"v":4144,"d":"4,144"},{"v":6764,"d":"6,764"},{"v":27973,"d":"27,973"}]
[null,"Renfrewshire2008-09","Renfrewshire","2008-09",1030,240,240,190,{"v":1520,"d":"1,520"},{"v":1190,"d":"1,190"},{"v":6400,"d":"6,400"},{"v":18218,"d":"18,218"},{"v":2015,"d":"2,015"},720,{"v":2735,"d":"2,735"},{"v":7948,"d":"7,948"},{"v":4152,"d":"4,152"},{"v":1846,"d":"1,846"},660,{"v":2506,"d":"2,506"},{"v":3665,"d":"3,665"},{"v":28295,"d":"28,295"}]
[null,"Scottish Borders2008-09","Scottish Borders","2008-09",720,270,260,110,{"v":1220,"d":"1,220"},{"v":1050,"d":"1,050"},{"v":5800,"d":"5,800"},{"v":12899,"d":"12,899"},{"v":2397,"d":"2,397"},466,{"v":2863,"d":"2,863"},{"v":7296,"d":"7,296"},{"v":4931,"d":"4,931"},{"v":2131,"d":"2,131"},414,{"v":2545,"d":"2,545"},{"v":4384,"d":"4,384"},{"v":22460,"d":"22,460"}]
[null,"Shetland Islands2008-09","Shetland Islands","2008-09",110,0,0,0,420,220,{"v":2200,"d":"2,200"},{"v":5268,"d":"5,268"},0,0,0,{"v":1902,"d":"1,902"},{"v":1913,"d":"1,913"},0,0,0,{"v":1739,"d":"1,739"},{"v":3585,"d":"3,585"}]
[null,"South Ayrshire2008-09","South Ayrshire","2008-09",810,340,340,270,{"v":1650,"d":"1,650"},{"v":1540,"d":"1,540"},{"v":14900,"d":"14,900"},{"v":16866,"d":"16,866"},{"v":2878,"d":"2,878"},{"v":1059,"d":"1,059"},{"v":3937,"d":"3,937"},{"v":11383,"d":"11,383"},{"v":12066,"d":"12,066"},{"v":2690,"d":"2,690"},990,{"v":3680,"d":"3,680"},{"v":10316,"d":"10,316"},{"v":23254,"d":"23,254"}]
[null,"South Lanarkshire2008-09","South Lanarkshire","2008-09",1720,460,450,330,{"v":3130,"d":"3,130"},{"v":2700,"d":"2,700"},{"v":24900,"d":"24,900"},{"v":33138,"d":"33,138"},{"v":3872,"d":"3,872"},{"v":1275,"d":"1,275"},{"v":5147,"d":"5,147"},{"v":22318,"d":"22,318"},{"v":16232,"d":"16,232"},{"v":3391,"d":"3,391"},{"v":1117,"d":"1,117"},{"v":4508,"d":"4,508"},{"v":14216,"d":"14,216"},{"v":50596,"d":"50,596"}]
[null,"Stirling2008-09","Stirling","2008-09",520,200,200,140,710,470,{"v":2600,"d":"2,600"},{"v":9694,"d":"9,694"},{"v":1915,"d":"1,915"},607,{"v":2522,"d":"2,522"},{"v":5495,"d":"5,495"},{"v":3095,"d":"3,095"},{"v":1737,"d":"1,737"},551,{"v":2288,"d":"2,288"},{"v":2807,"d":"2,807"},{"v":14803,"d":"14,803"}]
[null,"West Dunbartonshire2008-09","West Dunbartonshire","2008-09",510,90,90,50,{"v":1510,"d":"1,510"},{"v":1020,"d":"1,020"},{"v":7200,"d":"7,200"},{"v":14119,"d":"14,119"},696,162,858,{"v":1833,"d":"1,833"},{"v":5057,"d":"5,057"},644,150,794,{"v":4682,"d":"4,682"},{"v":14665,"d":"14,665"}]
[null,"West Lothian2008-09","West Lothian","2008-09",650,140,140,110,{"v":1250,"d":"1,250"},{"v":1130,"d":"1,130"},{"v":6800,"d":"6,800"},{"v":13642,"d":"13,642"},937,377,{"v":1314,"d":"1,314"},{"v":7916,"d":"7,916"},{"v":5446,"d":"5,446"},851,343,{"v":1194,"d":"1,194"},{"v":4807,"d":"4,807"},{"v":22057,"d":"22,057"}]
[null,"Scotland2008-09","Scotland","2008-09",31530,9640,{"v":9580,"d":"9,580"},{"v":6180,"d":"6,180"},{"v":54720,"d":"54,720"},{"v":44200,"d":"44,200"},{"v":333100,"d":"333,100"},{"v":601960,"d":"601,960"},{"v":82325,"d":"82,325"},{"v":23640,"d":"23,640"},{"v":105965,"d":"105,965"},{"v":377816,"d":"377,816"},{"v":276876,"d":"276,876"},{"v":72601,"d":"72,601"},{"v":21565,"d":"21,565"},{"v":94166,"d":"94,166"},{"v":246516,"d":"246,516"},{"v":857746,"d":"857,746"}]
[null,"Aberdeen City2009-10","Aberdeen City","2009-10",1530,450,440,300,{"v":1720,"d":"1,720"},{"v":1710,"d":"1,710"},{"v":12200,"d":"12,200"},{"v":28290,"d":"28,290"},{"v":3611,"d":"3,611"},{"v":1100,"d":"1,100"},{"v":4711,"d":"4,711"},{"v":12914,"d":"12,914"},{"v":9678,"d":"9,678"},{"v":3454,"d":"3,454"},{"v":1052,"d":"1,052"},{"v":4506,"d":"4,506"},{"v":9135,"d":"9,135"},{"v":32071,"d":"32,071"}]
[null,"Aberdeenshire2009-10","Aberdeenshire","2009-10",1360,460,460,330,{"v":2070,"d":"2,070"},{"v":1810,"d":"1,810"},{"v":9300,"d":"9,300"},{"v":27513,"d":"27,513"},{"v":4394,"d":"4,394"},{"v":1326,"d":"1,326"},{"v":5720,"d":"5,720"},{"v":13901,"d":"13,901"},{"v":10490,"d":"10,490"},{"v":3984,"d":"3,984"},{"v":1202,"d":"1,202"},{"v":5186,"d":"5,186"},{"v":9510,"d":"9,510"},{"v":39227,"d":"39,227"}]
[null,"Angus2009-10","Angus","2009-10",780,260,260,110,{"v":1520,"d":"1,520"},870,{"v":4000,"d":"4,000"},{"v":17705,"d":"17,705"},{"v":2417,"d":"2,417"},434,{"v":2851,"d":"2,851"},{"v":7307,"d":"7,307"},{"v":3498,"d":"3,498"},{"v":2153,"d":"2,153"},387,{"v":2540,"d":"2,540"},{"v":3068,"d":"3,068"},{"v":22293,"d":"22,293"}]
[null,"Argyll & Bute2009-10","Argyll & Bute","2009-10",690,200,200,70,750,720,{"v":7100,"d":"7,100"},{"v":13398,"d":"13,398"},{"v":1749,"d":"1,749"},230,{"v":1979,"d":"1,979"},{"v":9482,"d":"9,482"},{"v":7811,"d":"7,811"},{"v":1622,"d":"1,622"},214,{"v":1836,"d":"1,836"},{"v":7194,"d":"7,194"},{"v":18800,"d":"18,800"}]
[null,"Clackmannanshire2009-10","Clackmannanshire","2009-10",230,60,60,50,560,490,{"v":3300,"d":"3,300"},{"v":4486,"d":"4,486"},507,202,709,{"v":2803,"d":"2,803"},{"v":2515,"d":"2,515"},470,187,657,{"v":2329,"d":"2,329"},{"v":7839,"d":"7,839"}]
[null,"Dumfries & Galloway2009-10","Dumfries & Galloway","2009-10",910,370,370,300,{"v":1900,"d":"1,900"},{"v":1870,"d":"1,870"},{"v":20200,"d":"20,200"},{"v":10405,"d":"10,405"},{"v":3137,"d":"3,137"},{"v":1150,"d":"1,150"},{"v":4287,"d":"4,287"},{"v":15485,"d":"15,485"},{"v":12766,"d":"12,766"},{"v":2886,"d":"2,886"},{"v":1058,"d":"1,058"},{"v":3944,"d":"3,944"},{"v":11745,"d":"11,745"},{"v":32284,"d":"32,284"}]
[null,"Dundee City2009-10","Dundee City","2009-10",990,280,280,150,{"v":1930,"d":"1,930"},{"v":1010,"d":"1,010"},{"v":8200,"d":"8,200"},{"v":18796,"d":"18,796"},{"v":2288,"d":"2,288"},584,{"v":2872,"d":"2,872"},{"v":13371,"d":"13,371"},{"v":6937,"d":"6,937"},{"v":2137,"d":"2,137"},545,{"v":2682,"d":"2,682"},{"v":6271,"d":"6,271"},{"v":24909,"d":"24,909"}]
[null,"East Ayrshire2009-10","East Ayrshire","2009-10",710,180,180,120,{"v":1500,"d":"1,500"},{"v":1460,"d":"1,460"},{"v":10200,"d":"10,200"},{"v":15761,"d":"15,761"},{"v":1521,"d":"1,521"},467,{"v":1988,"d":"1,988"},{"v":11155,"d":"11,155"},{"v":8716,"d":"8,716"},{"v":1399,"d":"1,399"},430,{"v":1829,"d":"1,829"},{"v":6814,"d":"6,814"},{"v":20732,"d":"20,732"}]
[null,"East Dunbartonshire2009-10","East Dunbartonshire","2009-10",610,330,330,250,{"v":1110,"d":"1,110"},{"v":1010,"d":"1,010"},{"v":6100,"d":"6,100"},{"v":5789,"d":"5,789"},{"v":2798,"d":"2,798"},983,{"v":3781,"d":"3,781"},{"v":8382,"d":"8,382"},{"v":4437,"d":"4,437"},{"v":2542,"d":"2,542"},892,{"v":3434,"d":"3,434"},{"v":3916,"d":"3,916"},{"v":19707,"d":"19,707"}]
[null,"East Lothian2009-10","East Lothian","2009-10",570,160,160,130,{"v":1100,"d":"1,100"},920,{"v":7200,"d":"7,200"},{"v":11421,"d":"11,421"},{"v":1320,"d":"1,320"},599,{"v":1919,"d":"1,919"},{"v":6393,"d":"6,393"},{"v":6529,"d":"6,529"},{"v":1209,"d":"1,209"},549,{"v":1758,"d":"1,758"},{"v":5934,"d":"5,934"},{"v":17292,"d":"17,292"}]
[null,"East Renfrewshire2009-10","East Renfrewshire","2009-10",520,260,260,160,830,770,{"v":7100,"d":"7,100"},{"v":8821,"d":"8,821"},{"v":1779,"d":"1,779"},792,{"v":2571,"d":"2,571"},{"v":5590,"d":"5,590"},{"v":4727,"d":"4,727"},{"v":1717,"d":"1,717"},764,{"v":2481,"d":"2,481"},{"v":4562,"d":"4,562"},{"v":15922,"d":"15,922"}]
[null,"Edinburgh, City of2009-10","Edinburgh, City of","2009-10",2870,1360,{"v":1340,"d":"1,340"},970,{"v":3800,"d":"3,800"},{"v":3380,"d":"3,380"},{"v":27900,"d":"27,900"},{"v":56911,"d":"56,911"},{"v":9784,"d":"9,784"},{"v":3413,"d":"3,413"},{"v":13197,"d":"13,197"},{"v":30356,"d":"30,356"},{"v":21137,"d":"21,137"},{"v":9002,"d":"9,002"},{"v":3140,"d":"3,140"},{"v":12142,"d":"12,142"},{"v":19446,"d":"19,446"},{"v":67972,"d":"67,972"}]
[null,"Eilean Siar2009-10","Eilean Siar","2009-10",190,40,40,20,480,460,{"v":4300,"d":"4,300"},{"v":5948,"d":"5,948"},335,76,411,{"v":4964,"d":"4,964"},{"v":4268,"d":"4,268"},291,66,357,{"v":3414,"d":"3,414"},{"v":5791,"d":"5,791"}]
[null,"Falkirk2009-10","Falkirk","2009-10",760,150,150,140,{"v":1880,"d":"1,880"},{"v":1570,"d":"1,570"},{"v":10900,"d":"10,900"},{"v":13755,"d":"13,755"},{"v":1372,"d":"1,372"},562,{"v":1934,"d":"1,934"},{"v":13397,"d":"13,397"},{"v":8247,"d":"8,247"},{"v":1292,"d":"1,292"},529,{"v":1821,"d":"1,821"},{"v":7767,"d":"7,767"},{"v":24658,"d":"24,658"}]
[null,"Fife2009-10","Fife","2009-10",2150,730,730,370,{"v":3610,"d":"3,610"},{"v":2850,"d":"2,850"},{"v":15400,"d":"15,400"},{"v":38337,"d":"38,337"},{"v":6740,"d":"6,740"},963,{"v":7703,"d":"7,703"},{"v":20431,"d":"20,431"},{"v":21234,"d":"21,234"},{"v":6100,"d":"6,100"},871,{"v":6971,"d":"6,971"},{"v":18454,"d":"18,454"},{"v":62178,"d":"62,178"}]
[null,"Glasgow City2009-10","Glasgow City","2009-10",4180,710,700,410,{"v":6850,"d":"6,850"},{"v":6060,"d":"6,060"},{"v":51500,"d":"51,500"},{"v":82398,"d":"82,398"},{"v":9882,"d":"9,882"},{"v":1792,"d":"1,792"},{"v":11674,"d":"11,674"},{"v":55528,"d":"55,528"},{"v":54737,"d":"54,737"},{"v":5774,"d":"5,774"},{"v":1510,"d":"1,510"},{"v":7284,"d":"7,284"},{"v":49734,"d":"49,734"},{"v":82724,"d":"82,724"}]
[null,"Highland2009-10","Highland","2009-10",1510,410,400,110,{"v":1810,"d":"1,810"},{"v":1640,"d":"1,640"},{"v":10200,"d":"10,200"},{"v":28982,"d":"28,982"},{"v":3947,"d":"3,947"},476,{"v":4423,"d":"4,423"},{"v":14727,"d":"14,727"},{"v":11945,"d":"11,945"},{"v":3182,"d":"3,182"},384,{"v":3566,"d":"3,566"},{"v":9633,"d":"9,633"},{"v":41510,"d":"41,510"}]
[null,"Inverclyde2009-10","Inverclyde","2009-10",560,170,170,140,{"v":1150,"d":"1,150"},{"v":1090,"d":"1,090"},{"v":10000,"d":"10,000"},{"v":11995,"d":"11,995"},{"v":1423,"d":"1,423"},540,{"v":1963,"d":"1,963"},{"v":10404,"d":"10,404"},{"v":8164,"d":"8,164"},{"v":1318,"d":"1,318"},500,{"v":1818,"d":"1,818"},{"v":7225,"d":"7,225"},{"v":14566,"d":"14,566"}]
[null,"Midlothian2009-10","Midlothian","2009-10",440,80,80,60,730,610,{"v":4800,"d":"4,800"},{"v":7658,"d":"7,658"},681,238,919,{"v":5419,"d":"5,419"},{"v":5392,"d":"5,392"},624,218,842,{"v":4901,"d":"4,901"},{"v":13337,"d":"13,337"}]
[null,"Moray2009-10","Moray","2009-10",510,180,180,90,980,800,{"v":6700,"d":"6,700"},{"v":7630,"d":"7,630"},{"v":1785,"d":"1,785"},410,{"v":2195,"d":"2,195"},{"v":7407,"d":"7,407"},{"v":5897,"d":"5,897"},{"v":1452,"d":"1,452"},333,{"v":1785,"d":"1,785"},{"v":4796,"d":"4,796"},{"v":16593,"d":"16,593"}]
[null,"North Ayrshire2009-10","North Ayrshire","2009-10",830,310,310,200,{"v":1300,"d":"1,300"},{"v":1230,"d":"1,230"},{"v":9100,"d":"9,100"},{"v":17002,"d":"17,002"},{"v":2632,"d":"2,632"},767,{"v":3399,"d":"3,399"},{"v":8786,"d":"8,786"},{"v":9216,"d":"9,216"},{"v":2427,"d":"2,427"},707,{"v":3134,"d":"3,134"},{"v":8497,"d":"8,497"},{"v":25037,"d":"25,037"}]
[null,"North Lanarkshire2009-10","North Lanarkshire","2009-10",1430,220,220,180,{"v":3010,"d":"3,010"},{"v":2660,"d":"2,660"},{"v":25900,"d":"25,900"},{"v":39600,"d":"39,600"},{"v":1612,"d":"1,612"},616,{"v":2228,"d":"2,228"},{"v":33891,"d":"33,891"},{"v":20205,"d":"20,205"},{"v":1493,"d":"1,493"},570,{"v":2063,"d":"2,063"},{"v":15962,"d":"15,962"},{"v":49324,"d":"49,324"}]
[null,"Orkney Islands2009-10","Orkney Islands","2009-10",110,30,30,0,260,250,{"v":1300,"d":"1,300"},{"v":4621,"d":"4,621"},249,5,254,{"v":1935,"d":"1,935"},{"v":1673,"d":"1,673"},230,5,235,{"v":1549,"d":"1,549"},{"v":4032,"d":"4,032"}]
[null,"Perth & Kinross2009-10","Perth & Kinross","2009-10",990,370,370,160,{"v":1390,"d":"1,390"},{"v":1260,"d":"1,260"},{"v":8600,"d":"8,600"},{"v":18612,"d":"18,612"},{"v":3579,"d":"3,579"},766,{"v":4345,"d":"4,345"},{"v":10638,"d":"10,638"},{"v":7420,"d":"7,420"},{"v":3382,"d":"3,382"},724,{"v":4106,"d":"4,106"},{"v":6679,"d":"6,679"},{"v":28454,"d":"28,454"}]
[null,"Renfrewshire2009-10","Renfrewshire","2009-10",1030,230,230,180,{"v":1530,"d":"1,530"},{"v":1370,"d":"1,370"},{"v":7200,"d":"7,200"},{"v":19779,"d":"19,779"},{"v":1998,"d":"1,998"},718,{"v":2716,"d":"2,716"},{"v":9791,"d":"9,791"},{"v":5788,"d":"5,788"},{"v":1830,"d":"1,830"},658,{"v":2488,"d":"2,488"},{"v":5109,"d":"5,109"},{"v":28793,"d":"28,793"}]
[null,"Scottish Borders2009-10","Scottish Borders","2009-10",700,250,250,110,{"v":1200,"d":"1,200"},{"v":1160,"d":"1,160"},{"v":8800,"d":"8,800"},{"v":13344,"d":"13,344"},{"v":2363,"d":"2,363"},471,{"v":2834,"d":"2,834"},{"v":10590,"d":"10,590"},{"v":5957,"d":"5,957"},{"v":2101,"d":"2,101"},419,{"v":2520,"d":"2,520"},{"v":5296,"d":"5,296"},{"v":23040,"d":"23,040"}]
[null,"Shetland Islands2009-10","Shetland Islands","2009-10",110,0,0,0,410,230,{"v":2400,"d":"2,400"},{"v":6909,"d":"6,909"},0,0,0,{"v":2586,"d":"2,586"},{"v":2083,"d":"2,083"},0,0,0,{"v":1894,"d":"1,894"},{"v":3681,"d":"3,681"}]
[null,"South Ayrshire2009-10","South Ayrshire","2009-10",820,340,340,280,{"v":1670,"d":"1,670"},{"v":1630,"d":"1,630"},{"v":15400,"d":"15,400"},{"v":16143,"d":"16,143"},{"v":3030,"d":"3,030"},{"v":1148,"d":"1,148"},{"v":4178,"d":"4,178"},{"v":12051,"d":"12,051"},{"v":12871,"d":"12,871"},{"v":2794,"d":"2,794"},{"v":1059,"d":"1,059"},{"v":3853,"d":"3,853"},{"v":11024,"d":"11,024"},{"v":23641,"d":"23,641"}]
[null,{"$f":"C98&D98","v":"South Lanarkshire2009-10"},"South Lanarkshire","2009-10",1760,440,440,320,{"v":3130,"d":"3,130"},{"v":2840,"d":"2,840"},{"v":26900,"d":"26,900"},{"v":33543,"d":"33,543"},{"v":3905,"d":"3,905"},{"v":1358,"d":"1,358"},{"v":5263,"d":"5,263"},{"v":21920,"d":"21,920"},{"v":15280,"d":"15,280"},{"v":3515,"d":"3,515"},{"v":1222,"d":"1,222"},{"v":4737,"d":"4,737"},{"v":13787,"d":"13,787"},{"v":51552,"d":"51,552"}]
[null,"Stirling2009-10","Stirling","2009-10",520,190,190,130,810,630,{"v":4400,"d":"4,400"},{"v":10029,"d":"10,029"},{"v":1760,"d":"1,760"},567,{"v":2327,"d":"2,327"},{"v":6272,"d":"6,272"},{"v":3556,"d":"3,556"},{"v":1605,"d":"1,605"},516,{"v":2121,"d":"2,121"},{"v":3240,"d":"3,240"},{"v":15144,"d":"15,144"}]
[null,"West Dunbartonshire2009-10","West Dunbartonshire","2009-10",480,80,80,40,{"v":1410,"d":"1,410"},{"v":1100,"d":"1,100"},{"v":7400,"d":"7,400"},{"v":15261,"d":"15,261"},655,192,847,{"v":1981,"d":"1,981"},{"v":7248,"d":"7,248"},618,181,799,{"v":6711,"d":"6,711"},{"v":14761,"d":"14,761"}]
[null,"West Lothian2009-10","West Lothian","2009-10",620,100,100,90,{"v":1270,"d":"1,270"},{"v":1230,"d":"1,230"},{"v":7600,"d":"7,600"},{"v":14042,"d":"14,042"},{"v":1030,"d":"1,030"},410,{"v":1440,"d":"1,440"},{"v":8666,"d":"8,666"},{"v":5936,"d":"5,936"},935,373,{"v":1308,"d":"1,308"},{"v":5240,"d":"5,240"},{"v":22693,"d":"22,693"}]
[null,"Scotland2009-10","Scotland","2009-10",31470,9380,{"v":9330,"d":"9,330"},{"v":5960,"d":"5,960"},{"v":53660,"d":"53,660"},{"v":46660,"d":"46,660"},{"v":361700,"d":"361,700"},{"v":624884,"d":"624,884"},{"v":84283,"d":"84,283"},{"v":23355,"d":"23,355"},{"v":107638,"d":"107,638"},{"v":398523,"d":"398,523"},{"v":316358,"d":"316,358"},{"v":73538,"d":"73,538"},{"v":21265,"d":"21,265"},{"v":94803,"d":"94,803"},{"v":280836,"d":"280,836"},{"v":870557,"d":"870,557"}]
[null,"Aberdeen City2010-11","Aberdeen City","2010-11",1540,460,460,310,{"v":1740,"d":"1,740"},{"v":1740,"d":"1,740"},{"v":12900,"d":"12,900"},{"v":28577,"d":"28,577"},{"v":3689,"d":"3,689"},{"v":1143,"d":"1,143"},{"v":4832,"d":"4,832"},{"v":13108,"d":"13,108"},{"v":9819,"d":"9,819"},{"v":3534,"d":"3,534"},{"v":1101,"d":"1,101"},{"v":4635,"d":"4,635"},{"v":9329,"d":"9,329"},{"v":31983,"d":"31,983"}]
[null,"Aberdeenshire2010-11","Aberdeenshire","2010-11",1350,470,460,330,{"v":1860,"d":"1,860"},{"v":1790,"d":"1,790"},{"v":8200,"d":"8,200"},{"v":27022,"d":"27,022"},{"v":2990,"d":"2,990"},806,{"v":3796,"d":"3,796"},{"v":13173,"d":"13,173"},{"v":12036,"d":"12,036"},{"v":2732,"d":"2,732"},737,{"v":3469,"d":"3,469"},{"v":10997,"d":"10,997"},{"v":40062,"d":"40,062"}]
[null,"Angus2010-11","Angus","2010-11",840,260,260,110,{"v":1460,"d":"1,460"},860,{"v":4100,"d":"4,100"},{"v":16093,"d":"16,093"},{"v":2320,"d":"2,320"},439,{"v":2759,"d":"2,759"},{"v":6319,"d":"6,319"},{"v":4323,"d":"4,323"},{"v":2173,"d":"2,173"},411,{"v":2584,"d":"2,584"},{"v":3609,"d":"3,609"},{"v":22708,"d":"22,708"}]
[null,"Argyll & Bute2010-11","Argyll & Bute","2010-11",600,200,200,80,770,750,{"v":7400,"d":"7,400"},{"v":13922,"d":"13,922"},{"v":1663,"d":"1,663"},300,{"v":1963,"d":"1,963"},{"v":10840,"d":"10,840"},{"v":9631,"d":"9,631"},{"v":1563,"d":"1,563"},282,{"v":1845,"d":"1,845"},{"v":8842,"d":"8,842"},{"v":19111,"d":"19,111"}]
[null,"Clackmannanshire2010-11","Clackmannanshire","2010-11",230,50,50,40,560,530,{"v":3600,"d":"3,600"},{"v":5077,"d":"5,077"},417,174,591,{"v":2579,"d":"2,579"},{"v":3040,"d":"3,040"},389,162,551,{"v":2830,"d":"2,830"},{"v":8078,"d":"8,078"}]
[null,"Dumfries & Galloway2010-11","Dumfries & Galloway","2010-11",880,370,370,300,{"v":1880,"d":"1,880"},{"v":1860,"d":"1,860"},{"v":19800,"d":"19,800"},{"v":9300,"d":"9,300"},{"v":3464,"d":"3,464"},{"v":1281,"d":"1,281"},{"v":4745,"d":"4,745"},{"v":16134,"d":"16,134"},{"v":13403,"d":"13,403"},{"v":3207,"d":"3,207"},{"v":1187,"d":"1,187"},{"v":4394,"d":"4,394"},{"v":12410,"d":"12,410"},{"v":32712,"d":"32,712"}]
[null,"Dundee City2010-11","Dundee City","2010-11",960,280,280,150,{"v":1880,"d":"1,880"},980,{"v":7600,"d":"7,600"},{"v":19001,"d":"19,001"},{"v":2342,"d":"2,342"},595,{"v":2937,"d":"2,937"},{"v":13707,"d":"13,707"},{"v":7163,"d":"7,163"},{"v":2194,"d":"2,194"},556,{"v":2750,"d":"2,750"},{"v":6573,"d":"6,573"},{"v":24812,"d":"24,812"}]
[null,"East Ayrshire2010-11","East Ayrshire","2010-11",740,180,180,120,{"v":1480,"d":"1,480"},{"v":1460,"d":"1,460"},{"v":9500,"d":"9,500"},{"v":16331,"d":"16,331"},{"v":1532,"d":"1,532"},478,{"v":2010,"d":"2,010"},{"v":10682,"d":"10,682"},{"v":7779,"d":"7,779"},{"v":1419,"d":"1,419"},442,{"v":1861,"d":"1,861"},{"v":6095,"d":"6,095"},{"v":21144,"d":"21,144"}]
[null,"East Dunbartonshire2010-11","East Dunbartonshire","2010-11",580,310,300,230,{"v":1060,"d":"1,060"},{"v":1010,"d":"1,010"},{"v":6200,"d":"6,200"},{"v":6414,"d":"6,414"},{"v":2616,"d":"2,616"},923,{"v":3539,"d":"3,539"},{"v":8524,"d":"8,524"},{"v":4553,"d":"4,553"},{"v":2491,"d":"2,491"},879,{"v":3370,"d":"3,370"},{"v":4223,"d":"4,223"},{"v":20164,"d":"20,164"}]
[null,"East Lothian2010-11","East Lothian","2010-11",600,180,180,150,{"v":1140,"d":"1,140"},980,{"v":7500,"d":"7,500"},{"v":12543,"d":"12,543"},{"v":1674,"d":"1,674"},621,{"v":2295,"d":"2,295"},{"v":7551,"d":"7,551"},{"v":8048,"d":"8,048"},{"v":1534,"d":"1,534"},569,{"v":2103,"d":"2,103"},{"v":7315,"d":"7,315"},{"v":17522,"d":"17,522"}]
[null,"East Renfrewshire2010-11","East Renfrewshire","2010-11",510,250,250,160,860,840,{"v":7300,"d":"7,300"},{"v":9350,"d":"9,350"},{"v":2060,"d":"2,060"},595,{"v":2655,"d":"2,655"},{"v":5441,"d":"5,441"},{"v":5412,"d":"5,412"},{"v":1948,"d":"1,948"},562,{"v":2510,"d":"2,510"},{"v":5333,"d":"5,333"},{"v":16166,"d":"16,166"}]
[null,"Edinburgh, City of2010-11","Edinburgh, City of","2010-11",2870,1340,{"v":1330,"d":"1,330"},950,{"v":3620,"d":"3,620"},{"v":3370,"d":"3,370"},{"v":29600,"d":"29,600"},{"v":54344,"d":"54,344"},{"v":9889,"d":"9,889"},{"v":3424,"d":"3,424"},{"v":13313,"d":"13,313"},{"v":31563,"d":"31,563"},{"v":30648,"d":"30,648"},{"v":9098,"d":"9,098"},{"v":3150,"d":"3,150"},{"v":12248,"d":"12,248"},{"v":28196,"d":"28,196"},{"v":68374,"d":"68,374"}]
[null,"Eilean Siar2010-11","Eilean Siar","2010-11",190,40,40,20,450,430,{"v":3800,"d":"3,800"},{"v":5968,"d":"5,968"},438,72,510,{"v":5520,"d":"5,520"},{"v":4274,"d":"4,274"},381,63,444,{"v":3419,"d":"3,419"},{"v":5884,"d":"5,884"}]
[null,"Falkirk2010-11","Falkirk","2010-11",780,140,140,130,{"v":1770,"d":"1,770"},{"v":1570,"d":"1,570"},{"v":11600,"d":"11,600"},{"v":13075,"d":"13,075"},{"v":1313,"d":"1,313"},552,{"v":1865,"d":"1,865"},{"v":13126,"d":"13,126"},{"v":8860,"d":"8,860"},{"v":1238,"d":"1,238"},521,{"v":1759,"d":"1,759"},{"v":8359,"d":"8,359"},{"v":25138,"d":"25,138"}]
[null,"Fife2010-11","Fife","2010-11",2170,830,830,420,{"v":3200,"d":"3,200"},{"v":2920,"d":"2,920"},{"v":18900,"d":"18,900"},{"v":41174,"d":"41,174"},{"v":7183,"d":"7,183"},{"v":1000,"d":"1,000"},{"v":8183,"d":"8,183"},{"v":21905,"d":"21,905"},{"v":19698,"d":"19,698"},{"v":6531,"d":"6,531"},909,{"v":7440,"d":"7,440"},{"v":17777,"d":"17,777"},{"v":63308,"d":"63,308"}]
[null,"Glasgow City2010-11","Glasgow City","2010-11",4000,700,700,390,{"v":6360,"d":"6,360"},{"v":6070,"d":"6,070"},{"v":56400,"d":"56,400"},{"v":80543,"d":"80,543"},{"v":10154,"d":"10,154"},{"v":1752,"d":"1,752"},{"v":11906,"d":"11,906"},{"v":56552,"d":"56,552"},{"v":60412,"d":"60,412"},{"v":5725,"d":"5,725"},{"v":1477,"d":"1,477"},{"v":7202,"d":"7,202"},{"v":54890,"d":"54,890"},{"v":82366,"d":"82,366"}]
[null,"Highland2010-11","Highland","2010-11",1510,420,420,110,{"v":1740,"d":"1,740"},{"v":1610,"d":"1,610"},{"v":10500,"d":"10,500"},{"v":29971,"d":"29,971"},{"v":4078,"d":"4,078"},496,{"v":4574,"d":"4,574"},{"v":15229,"d":"15,229"},{"v":12352,"d":"12,352"},{"v":3370,"d":"3,370"},412,{"v":3782,"d":"3,782"},{"v":10035,"d":"10,035"},{"v":42376,"d":"42,376"}]
[null,"Inverclyde2010-11","Inverclyde","2010-11",610,160,160,130,{"v":1110,"d":"1,110"},{"v":1060,"d":"1,060"},{"v":9100,"d":"9,100"},{"v":11131,"d":"11,131"},{"v":1436,"d":"1,436"},529,{"v":1965,"d":"1,965"},{"v":9535,"d":"9,535"},{"v":8800,"d":"8,800"},{"v":1305,"d":"1,305"},481,{"v":1786,"d":"1,786"},{"v":7925,"d":"7,925"},{"v":14672,"d":"14,672"}]
[null,"Midlothian2010-11","Midlothian","2010-11",400,70,60,50,760,680,{"v":5300,"d":"5,300"},{"v":7307,"d":"7,307"},595,209,804,{"v":5694,"d":"5,694"},{"v":4443,"d":"4,443"},577,202,779,{"v":4301,"d":"4,301"},{"v":13702,"d":"13,702"}]
[null,"Moray2010-11","Moray","2010-11",510,170,170,70,{"v":1030,"d":"1,030"},880,{"v":7200,"d":"7,200"},{"v":7525,"d":"7,525"},{"v":1914,"d":"1,914"},376,{"v":2290,"d":"2,290"},{"v":7428,"d":"7,428"},{"v":6218,"d":"6,218"},{"v":1569,"d":"1,569"},307,{"v":1876,"d":"1,876"},{"v":5096,"d":"5,096"},{"v":17008,"d":"17,008"}]
[null,"North Ayrshire2010-11","North Ayrshire","2010-11",880,330,330,220,{"v":1330,"d":"1,330"},{"v":1310,"d":"1,310"},{"v":9600,"d":"9,600"},{"v":17670,"d":"17,670"},{"v":2910,"d":"2,910"},849,{"v":3759,"d":"3,759"},{"v":10512,"d":"10,512"},{"v":9001,"d":"9,001"},{"v":2672,"d":"2,672"},780,{"v":3452,"d":"3,452"},{"v":8264,"d":"8,264"},{"v":25539,"d":"25,539"}]
[null,"North Lanarkshire2010-11","North Lanarkshire","2010-11",1400,220,220,180,{"v":2840,"d":"2,840"},{"v":2600,"d":"2,600"},{"v":23300,"d":"23,300"},{"v":41202,"d":"41,202"},{"v":1891,"d":"1,891"},711,{"v":2602,"d":"2,602"},{"v":34274,"d":"34,274"},{"v":17268,"d":"17,268"},{"v":1751,"d":"1,751"},658,{"v":2409,"d":"2,409"},{"v":13642,"d":"13,642"},{"v":49956,"d":"49,956"}]
[null,"Orkney Islands2010-11","Orkney Islands","2010-11",100,30,30,0,230,220,{"v":1100,"d":"1,100"},{"v":4727,"d":"4,727"},243,4,247,{"v":1882,"d":"1,882"},{"v":1682,"d":"1,682"},225,4,229,{"v":1558,"d":"1,558"},{"v":4157,"d":"4,157"}]
[null,"Perth & Kinross2010-11","Perth & Kinross","2010-11",850,360,360,150,{"v":1390,"d":"1,390"},{"v":1320,"d":"1,320"},{"v":9300,"d":"9,300"},{"v":17834,"d":"17,834"},{"v":3035,"d":"3,035"},595,{"v":3630,"d":"3,630"},{"v":12240,"d":"12,240"},{"v":11372,"d":"11,372"},{"v":2837,"d":"2,837"},556,{"v":3393,"d":"3,393"},{"v":10457,"d":"10,457"},{"v":29072,"d":"29,072"}]
[null,"Renfrewshire2010-11","Renfrewshire","2010-11",1020,240,240,190,{"v":1290,"d":"1,290"},{"v":1200,"d":"1,200"},{"v":6900,"d":"6,900"},{"v":18533,"d":"18,533"},{"v":2124,"d":"2,124"},776,{"v":2900,"d":"2,900"},{"v":9942,"d":"9,942"},{"v":6104,"d":"6,104"},{"v":1916,"d":"1,916"},699,{"v":2615,"d":"2,615"},{"v":5476,"d":"5,476"},{"v":29101,"d":"29,101"}]
[null,"Scottish Borders2010-11","Scottish Borders","2010-11",700,280,280,120,{"v":1210,"d":"1,210"},{"v":1190,"d":"1,190"},{"v":8200,"d":"8,200"},{"v":11649,"d":"11,649"},{"v":2483,"d":"2,483"},508,{"v":2991,"d":"2,991"},{"v":8573,"d":"8,573"},{"v":6010,"d":"6,010"},{"v":2239,"d":"2,239"},458,{"v":2697,"d":"2,697"},{"v":5391,"d":"5,391"},{"v":23481,"d":"23,481"}]
[null,"Shetland Islands2010-11","Shetland Islands","2010-11",110,0,0,0,450,260,{"v":2800,"d":"2,800"},{"v":9106,"d":"9,106"},0,0,0,{"v":3008,"d":"3,008"},{"v":2304,"d":"2,304"},0,0,0,{"v":2067,"d":"2,067"},{"v":3739,"d":"3,739"}]
[null,"South Ayrshire2010-11","South Ayrshire","2010-11",840,380,380,320,{"v":1770,"d":"1,770"},{"v":1740,"d":"1,740"},{"v":16100,"d":"16,100"},{"v":16049,"d":"16,049"},{"v":3461,"d":"3,461"},{"v":1371,"d":"1,371"},{"v":4832,"d":"4,832"},{"v":11818,"d":"11,818"},{"v":12880,"d":"12,880"},{"v":3188,"d":"3,188"},{"v":1262,"d":"1,262"},{"v":4450,"d":"4,450"},{"v":10841,"d":"10,841"},{"v":23993,"d":"23,993"}]
[null,"South Lanarkshire2010-11","South Lanarkshire","2010-11",1710,490,480,320,{"v":3060,"d":"3,060"},{"v":2790,"d":"2,790"},{"v":26700,"d":"26,700"},{"v":34892,"d":"34,892"},{"v":3713,"d":"3,713"},{"v":1335,"d":"1,335"},{"v":5048,"d":"5,048"},{"v":22629,"d":"22,629"},{"v":16751,"d":"16,751"},{"v":3307,"d":"3,307"},{"v":1191,"d":"1,191"},{"v":4498,"d":"4,498"},{"v":14977,"d":"14,977"},{"v":52311,"d":"52,311"}]
[null,"Stirling2010-11","Stirling","2010-11",470,160,160,110,800,640,{"v":5700,"d":"5,700"},{"v":10884,"d":"10,884"},{"v":1835,"d":"1,835"},575,{"v":2410,"d":"2,410"},{"v":6255,"d":"6,255"},{"v":4323,"d":"4,323"},{"v":1619,"d":"1,619"},508,{"v":2127,"d":"2,127"},{"v":3815,"d":"3,815"},{"v":15335,"d":"15,335"}]
[null,"West Dunbartonshire2010-11","West Dunbartonshire","2010-11",480,80,80,30,{"v":1350,"d":"1,350"},{"v":1070,"d":"1,070"},{"v":7300,"d":"7,300"},{"v":14974,"d":"14,974"},704,123,827,{"v":1944,"d":"1,944"},{"v":7159,"d":"7,159"},652,114,766,{"v":6629,"d":"6,629"},{"v":14861,"d":"14,861"}]
[null,"West Lothian2010-11","West Lothian","2010-11",620,120,120,100,{"v":1300,"d":"1,300"},{"v":1280,"d":"1,280"},{"v":8200,"d":"8,200"},{"v":14646,"d":"14,646"},{"v":1177,"d":"1,177"},479,{"v":1656,"d":"1,656"},{"v":9050,"d":"9,050"},{"v":6032,"d":"6,032"},{"v":1140,"d":"1,140"},464,{"v":1604,"d":"1,604"},{"v":5731,"d":"5,731"},{"v":23387,"d":"23,387"}]
[null,"Scotland2010-11","Scotland","2010-11",31020,9550,{"v":9490,"d":"9,490"},{"v":6000,"d":"6,000"},{"v":51730,"d":"51,730"},{"v":46950,"d":"46,950"},{"v":371900,"d":"371,900"},{"v":626834,"d":"626,834"},{"v":85343,"d":"85,343"},{"v":23091,"d":"23,091"},{"v":108434,"d":"108,434"},{"v":406737,"d":"406,737"},{"v":341798,"d":"341,798"},{"v":74524,"d":"74,524"},{"v":21104,"d":"21,104"},{"v":95628,"d":"95,628"},{"v":306402,"d":"306,402"},{"v":882222,"d":"882,222"}]
[null,"Aberdeen City2011-12","Aberdeen City","2011-12",1440,530,530,380,{"v":1780,"d":"1,780"},{"v":1780,"d":"1,780"},{"v":13500,"d":"13,500"},{"v":32261,"d":"32,261"},{"v":3616,"d":"3,616"},{"v":1145,"d":"1,145"},{"v":4761,"d":"4,761"},{"v":13061,"d":"13,061"},{"v":10278,"d":"10,278"},{"v":3476,"d":"3,476"},{"v":1107,"d":"1,107"},{"v":4583,"d":"4,583"},{"v":9814,"d":"9,814"},{"v":33606,"d":"33,606"}]
[null,"Aberdeenshire2011-12","Aberdeenshire","2011-12",1350,480,470,320,{"v":1830,"d":"1,830"},{"v":1660,"d":"1,660"},{"v":13100,"d":"13,100"},{"v":30945,"d":"30,945"},{"v":2752,"d":"2,752"},702,{"v":3454,"d":"3,454"},{"v":14917,"d":"14,917"},{"v":11790,"d":"11,790"},{"v":2515,"d":"2,515"},641,{"v":3156,"d":"3,156"},{"v":10772,"d":"10,772"},{"v":43322,"d":"43,322"}]
[null,"Angus2011-12","Angus","2011-12",810,250,250,110,{"v":1330,"d":"1,330"},800,{"v":4000,"d":"4,000"},{"v":16762,"d":"16,762"},{"v":2296,"d":"2,296"},466,{"v":2762,"d":"2,762"},{"v":7115,"d":"7,115"},{"v":6618,"d":"6,618"},{"v":2002,"d":"2,002"},411,{"v":2413,"d":"2,413"},{"v":6055,"d":"6,055"},{"v":24267,"d":"24,267"}]
[null,"Argyll & Bute2011-12","Argyll & Bute","2011-12",560,190,190,80,840,830,{"v":8600,"d":"8,600"},{"v":12920,"d":"12,920"},{"v":1703,"d":"1,703"},302,{"v":2005,"d":"2,005"},{"v":11393,"d":"11,393"},{"v":9161,"d":"9,161"},{"v":1603,"d":"1,603"},285,{"v":1888,"d":"1,888"},{"v":8442,"d":"8,442"},{"v":20319,"d":"20,319"}]
[null,"Clackmannanshire2011-12","Clackmannanshire","2011-12",210,50,50,50,550,530,{"v":4000,"d":"4,000"},{"v":4215,"d":"4,215"},490,191,681,{"v":2696,"d":"2,696"},{"v":3444,"d":"3,444"},454,177,631,{"v":3189,"d":"3,189"},{"v":8826,"d":"8,826"}]
[null,"Dumfries & Galloway2011-12","Dumfries & Galloway","2011-12",930,370,370,300,{"v":1990,"d":"1,990"},{"v":1980,"d":"1,980"},{"v":26400,"d":"26,400"},{"v":8250,"d":"8,250"},{"v":3564,"d":"3,564"},{"v":1309,"d":"1,309"},{"v":4873,"d":"4,873"},{"v":16699,"d":"16,699"},{"v":13556,"d":"13,556"},{"v":3300,"d":"3,300"},{"v":1212,"d":"1,212"},{"v":4512,"d":"4,512"},{"v":12552,"d":"12,552"},{"v":34661,"d":"34,661"}]
[null,"Dundee City2011-12","Dundee City","2011-12",940,290,280,160,{"v":1610,"d":"1,610"},{"v":1000,"d":"1,000"},{"v":7800,"d":"7,800"},{"v":18575,"d":"18,575"},{"v":2357,"d":"2,357"},600,{"v":2957,"d":"2,957"},{"v":13540,"d":"13,540"},{"v":7711,"d":"7,711"},{"v":2217,"d":"2,217"},565,{"v":2782,"d":"2,782"},{"v":7167,"d":"7,167"},{"v":25633,"d":"25,633"}]
[null,"East Ayrshire2011-12","East Ayrshire","2011-12",570,160,160,100,{"v":1630,"d":"1,630"},{"v":1610,"d":"1,610"},{"v":11000,"d":"11,000"},{"v":14365,"d":"14,365"},{"v":1410,"d":"1,410"},412,{"v":1822,"d":"1,822"},{"v":10405,"d":"10,405"},{"v":7979,"d":"7,979"},{"v":1305,"d":"1,305"},382,{"v":1687,"d":"1,687"},{"v":6257,"d":"6,257"},{"v":22512,"d":"22,512"}]
[null,"East Dunbartonshire2011-12","East Dunbartonshire","2011-12",580,310,310,230,960,950,{"v":6500,"d":"6,500"},{"v":5643,"d":"5,643"},{"v":2660,"d":"2,660"},947,{"v":3607,"d":"3,607"},{"v":8890,"d":"8,890"},{"v":4732,"d":"4,732"},{"v":2534,"d":"2,534"},902,{"v":3436,"d":"3,436"},{"v":4389,"d":"4,389"},{"v":21514,"d":"21,514"}]
[null,"East Lothian2011-12","East Lothian","2011-12",610,190,190,160,{"v":1180,"d":"1,180"},{"v":1010,"d":"1,010"},{"v":8700,"d":"8,700"},{"v":12997,"d":"12,997"},{"v":2248,"d":"2,248"},812,{"v":3060,"d":"3,060"},{"v":4401,"d":"4,401"},{"v":7596,"d":"7,596"},{"v":2036,"d":"2,036"},736,{"v":2772,"d":"2,772"},{"v":6986,"d":"6,986"},{"v":18571,"d":"18,571"}]
[null,"East Renfrewshire2011-12","East Renfrewshire","2011-12",510,250,250,160,900,850,{"v":7600,"d":"7,600"},{"v":10280,"d":"10,280"},{"v":2210,"d":"2,210"},635,{"v":2845,"d":"2,845"},{"v":4557,"d":"4,557"},{"v":5208,"d":"5,208"},{"v":2062,"d":"2,062"},593,{"v":2655,"d":"2,655"},{"v":5149,"d":"5,149"},{"v":16860,"d":"16,860"}]
[null,"Edinburgh, City of2011-12","Edinburgh, City of","2011-12",2800,1310,1300,890,{"v":3510,"d":"3,510"},{"v":3380,"d":"3,380"},{"v":30100,"d":"30,100"},{"v":51394,"d":"51,394"},{"v":9944,"d":"9,944"},{"v":3295,"d":"3,295"},{"v":13239,"d":"13,239"},{"v":33043,"d":"33,043"},{"v":30968,"d":"30,968"},{"v":9148,"d":"9,148"},{"v":3032,"d":"3,032"},{"v":12180,"d":"12,180"},{"v":28491,"d":"28,491"},{"v":70980,"d":"70,980"}]
[null,"Eilean Siar2011-12","Eilean Siar","2011-12",190,50,50,20,470,450,{"v":4000,"d":"4,000"},{"v":6574,"d":"6,574"},399,74,473,{"v":5051,"d":"5,051"},{"v":4750,"d":"4,750"},347,64,411,{"v":3593,"d":"3,593"},{"v":6226,"d":"6,226"}]
[null,"Falkirk2011-12","Falkirk","2011-12",800,140,140,120,{"v":1780,"d":"1,780"},{"v":1610,"d":"1,610"},{"v":10600,"d":"10,600"},{"v":14599,"d":"14,599"},{"v":1199,"d":"1,199"},482,{"v":1681,"d":"1,681"},{"v":12711,"d":"12,711"},{"v":8837,"d":"8,837"},{"v":1132,"d":"1,132"},455,{"v":1587,"d":"1,587"},{"v":8342,"d":"8,342"},{"v":26803,"d":"26,803"}]
[null,"Fife2011-12","Fife","2011-12",2230,930,930,480,{"v":3100,"d":"3,100"},{"v":2810,"d":"2,810"},{"v":18300,"d":"18,300"},{"v":41430,"d":"41,430"},{"v":8475,"d":"8,475"},{"v":1128,"d":"1,128"},{"v":9603,"d":"9,603"},{"v":22617,"d":"22,617"},{"v":22160,"d":"22,160"},{"v":8343,"d":"8,343"},{"v":1117,"d":"1,117"},{"v":9460,"d":"9,460"},{"v":20846,"d":"20,846"},{"v":67683,"d":"67,683"}]
[null,"Glasgow City2011-12","Glasgow City","2011-12",3960,710,710,380,{"v":6180,"d":"6,180"},{"v":5910,"d":"5,910"},{"v":56000,"d":"56,000"},{"v":83387,"d":"83,387"},{"v":10361,"d":"10,361"},{"v":1709,"d":"1,709"},{"v":12070,"d":"12,070"},{"v":54315,"d":"54,315"},{"v":60844,"d":"60,844"},{"v":5898,"d":"5,898"},{"v":1441,"d":"1,441"},{"v":7339,"d":"7,339"},{"v":55286,"d":"55,286"},{"v":84809,"d":"84,809"}]
[null,"Highland2011-12","Highland","2011-12",1500,410,410,120,{"v":1680,"d":"1,680"},{"v":1590,"d":"1,590"},{"v":10700,"d":"10,700"},{"v":30986,"d":"30,986"},{"v":4080,"d":"4,080"},494,{"v":4574,"d":"4,574"},{"v":15889,"d":"15,889"},{"v":12352,"d":"12,352"},{"v":3406,"d":"3,406"},442,{"v":3848,"d":"3,848"},{"v":12241,"d":"12,241"},{"v":45331,"d":"45,331"}]
[null,"Inverclyde2011-12","Inverclyde","2011-12",600,160,160,130,{"v":1100,"d":"1,100"},{"v":1060,"d":"1,060"},{"v":8600,"d":"8,600"},{"v":11265,"d":"11,265"},{"v":1426,"d":"1,426"},530,{"v":1956,"d":"1,956"},{"v":6394,"d":"6,394"},{"v":7240,"d":"7,240"},{"v":1296,"d":"1,296"},482,{"v":1778,"d":"1,778"},{"v":6520,"d":"6,520"},{"v":15359,"d":"15,359"}]
[null,"Midlothian2011-12","Midlothian","2011-12",390,70,70,60,810,740,{"v":5900,"d":"5,900"},{"v":7751,"d":"7,751"},573,214,787,{"v":5768,"d":"5,768"},{"v":4701,"d":"4,701"},556,207,763,{"v":4555,"d":"4,555"},{"v":14849,"d":"14,849"}]
[null,"Moray2011-12","Moray","2011-12",510,170,170,60,{"v":1050,"d":"1,050"},920,{"v":7600,"d":"7,600"},{"v":7338,"d":"7,338"},{"v":1707,"d":"1,707"},298,{"v":2005,"d":"2,005"},{"v":7890,"d":"7,890"},{"v":6833,"d":"6,833"},{"v":1533,"d":"1,533"},265,{"v":1798,"d":"1,798"},{"v":6104,"d":"6,104"},{"v":18135,"d":"18,135"}]
[null,"North Ayrshire2011-12","North Ayrshire","2011-12",900,340,340,220,{"v":1440,"d":"1,440"},{"v":1360,"d":"1,360"},{"v":11800,"d":"11,800"},{"v":16365,"d":"16,365"},{"v":2665,"d":"2,665"},856,{"v":3521,"d":"3,521"},{"v":10987,"d":"10,987"},{"v":8902,"d":"8,902"},{"v":2481,"d":"2,481"},796,{"v":3277,"d":"3,277"},{"v":8288,"d":"8,288"},{"v":27292,"d":"27,292"}]
[null,"North Lanarkshire2011-12","North Lanarkshire","2011-12",1360,220,220,180,{"v":2800,"d":"2,800"},{"v":2630,"d":"2,630"},{"v":22200,"d":"22,200"},{"v":36022,"d":"36,022"},{"v":1830,"d":"1,830"},709,{"v":2539,"d":"2,539"},{"v":30669,"d":"30,669"},{"v":18612,"d":"18,612"},{"v":1694,"d":"1,694"},657,{"v":2351,"d":"2,351"},{"v":14703,"d":"14,703"},{"v":53499,"d":"53,499"}]
[null,"Orkney Islands2011-12","Orkney Islands","2011-12",100,30,30,0,220,210,{"v":1100,"d":"1,100"},{"v":4433,"d":"4,433"},240,4,244,{"v":1825,"d":"1,825"},{"v":1660,"d":"1,660"},221,4,225,{"v":1528,"d":"1,528"},{"v":4456,"d":"4,456"}]
[null,"Perth & Kinross2011-12","Perth & Kinross","2011-12",820,340,340,140,{"v":1230,"d":"1,230"},{"v":1130,"d":"1,130"},{"v":8500,"d":"8,500"},{"v":16845,"d":"16,845"},{"v":3162,"d":"3,162"},565,{"v":3727,"d":"3,727"},{"v":12288,"d":"12,288"},{"v":11454,"d":"11,454"},{"v":2864,"d":"2,864"},512,{"v":3376,"d":"3,376"},{"v":11072,"d":"11,072"},{"v":31007,"d":"31,007"}]
[null,"Renfrewshire2011-12","Renfrewshire","2011-12",1080,260,260,200,{"v":1300,"d":"1,300"},{"v":1260,"d":"1,260"},{"v":7900,"d":"7,900"},{"v":18592,"d":"18,592"},{"v":2361,"d":"2,361"},842,{"v":3203,"d":"3,203"},{"v":8993,"d":"8,993"},{"v":5577,"d":"5,577"},{"v":2138,"d":"2,138"},763,{"v":2901,"d":"2,901"},{"v":5090,"d":"5,090"},{"v":30967,"d":"30,967"}]
[null,"Scottish Borders2011-12","Scottish Borders","2011-12",680,270,270,120,{"v":1260,"d":"1,260"},{"v":1240,"d":"1,240"},{"v":8800,"d":"8,800"},{"v":11170,"d":"11,170"},{"v":2457,"d":"2,457"},507,{"v":2964,"d":"2,964"},{"v":8537,"d":"8,537"},{"v":5940,"d":"5,940"},{"v":2232,"d":"2,232"},427,{"v":2659,"d":"2,659"},{"v":5351,"d":"5,351"},{"v":25090,"d":"25,090"}]
[null,{"$f":"C162&D162","v":"Shetland Islands2011-12"},"Shetland Islands","2011-12",100,0,0,0,420,230,{"v":2300,"d":"2,300"},{"v":7917,"d":"7,917"},179,0,179,{"v":2763,"d":"2,763"},{"v":2263,"d":"2,263"},163,0,163,{"v":2065,"d":"2,065"},{"v":3965,"d":"3,965"}]
[null,"South Ayrshire2011-12","South Ayrshire","2011-12",850,390,380,330,{"v":1630,"d":"1,630"},{"v":1600,"d":"1,600"},{"v":13700,"d":"13,700"},{"v":15947,"d":"15,947"},{"v":3546,"d":"3,546"},{"v":1434,"d":"1,434"},{"v":4980,"d":"4,980"},{"v":10748,"d":"10,748"},{"v":11876,"d":"11,876"},{"v":3246,"d":"3,246"},{"v":1313,"d":"1,313"},{"v":4559,"d":"4,559"},{"v":9945,"d":"9,945"},{"v":25345,"d":"25,345"}]
[null,"South Lanarkshire2011-12","South Lanarkshire","2011-12",1730,480,480,320,{"v":3050,"d":"3,050"},{"v":2820,"d":"2,820"},{"v":27200,"d":"27,200"},{"v":37245,"d":"37,245"},{"v":4536,"d":"4,536"},{"v":1390,"d":"1,390"},{"v":5926,"d":"5,926"},{"v":22008,"d":"22,008"},{"v":14666,"d":"14,666"},{"v":4113,"d":"4,113"},{"v":1260,"d":"1,260"},{"v":5373,"d":"5,373"},{"v":13299,"d":"13,299"},{"v":55706,"d":"55,706"}]
[null,"Stirling2011-12","Stirling","2011-12",460,160,160,120,800,690,{"v":6600,"d":"6,600"},{"v":9602,"d":"9,602"},{"v":1854,"d":"1,854"},567,{"v":2421,"d":"2,421"},{"v":5480,"d":"5,480"},{"v":5296,"d":"5,296"},{"v":1691,"d":"1,691"},517,{"v":2208,"d":"2,208"},{"v":4829,"d":"4,829"},{"v":16362,"d":"16,362"}]
[null,"West Dunbartonshire2011-12","West Dunbartonshire","2011-12",510,80,80,30,{"v":1360,"d":"1,360"},{"v":1110,"d":"1,110"},{"v":8000,"d":"8,000"},{"v":14697,"d":"14,697"},736,146,882,{"v":1779,"d":"1,779"},{"v":7541,"d":"7,541"},681,135,816,{"v":6982,"d":"6,982"},{"v":15553,"d":"15,553"}]
[null,"West Lothian2011-12","West Lothian","2011-12",670,140,130,110,{"v":1350,"d":"1,350"},{"v":1250,"d":"1,250"},{"v":8100,"d":"8,100"},{"v":13833,"d":"13,833"},{"v":1196,"d":"1,196"},481,{"v":1677,"d":"1,677"},{"v":10172,"d":"10,172"},{"v":6106,"d":"6,106"},{"v":1157,"d":"1,157"},465,{"v":1622,"d":"1,622"},{"v":5898,"d":"5,898"},{"v":25684,"d":"25,684"}]
[null,"Scotland2011-12","Scotland","2011-12",30750,9720,9660,{"v":6050,"d":"6,050"},{"v":51120,"d":"51,120"},{"v":47010,"d":"47,010"},{"v":389000,"d":"389,000"},{"v":624605,"d":"624,605"},{"v":88232,"d":"88,232"},{"v":23246,"d":"23,246"},{"v":111478,"d":"111,478"},{"v":397601,"d":"397,601"},{"v":346651,"d":"346,651"},{"v":77844,"d":"77,844"},{"v":21365,"d":"21,365"},{"v":99209,"d":"99,209"},{"v":315800,"d":"315,800"},{"v":935192,"d":"935,192"}]
[null,"Aberdeen City2012-13","Aberdeen City","2012-13",1200,530,530,400,{"v":1610,"d":"1,610"},{"v":1610,"d":"1,610"},{"v":10700,"d":"10,700"},{"v":28241.87441293883,"d":"28,242"},{"v":3418,"d":"3,418"},{"v":1087,"d":"1,087"},{"v":4505,"d":"4,505"},{"v":16027.219076552778,"d":"16,027"},{"v":10847,"d":"10,847"},{"v":3305,"d":"3,305"},{"v":1052,"d":"1,052"},{"v":4357,"d":"4,357"},{"v":10488,"d":"10,488"},{"v":33150,"d":"33,150"}]
[null,"Aberdeenshire2012-13","Aberdeenshire","2012-13",1370,470,460,320,{"v":1960,"d":"1,960"},{"v":1740,"d":"1,740"},{"v":11600,"d":"11,600"},{"v":29437.59769194536,"d":"29,438"},{"v":3360,"d":"3,360"},{"v":1030,"d":"1,030"},{"v":4390,"d":"4,390"},{"v":14131.047479981158,"d":"14,131"},{"v":8148,"d":"8,148"},{"v":3148,"d":"3,148"},965,{"v":4113,"d":"4,113"},{"v":7659,"d":"7,659"},{"v":42920,"d":"42,920"}]
[null,"Angus2012-13","Angus","2012-13",740,230,230,90,{"v":1270,"d":"1,270"},730,{"v":3500,"d":"3,500"},{"v":15712.636995412222,"d":"15,713"},{"v":2625,"d":"2,625"},474,{"v":3099,"d":"3,099"},{"v":7155.378912506448,"d":"7,155"},{"v":5944,"d":"5,944"},{"v":2529,"d":"2,529"},460,{"v":2989,"d":"2,989"},{"v":5793,"d":"5,793"},{"v":24235,"d":"24,235"}]
[null,"Argyll & Bute2012-13","Argyll & Bute","2012-13",510,170,170,70,930,920,{"v":9400,"d":"9,400"},{"v":12974.38680800181,"d":"12,974"},{"v":1626,"d":"1,626"},332,{"v":1958,"d":"1,958"},{"v":11966.342597679604,"d":"11,966"},{"v":10560,"d":"10,560"},{"v":1533,"d":"1,533"},313,{"v":1846,"d":"1,846"},{"v":9807,"d":"9,807"},{"v":20169,"d":"20,169"}]
[null,"Clackmannanshire2012-13","Clackmannanshire","2012-13",220,60,60,50,570,550,{"v":4500,"d":"4,500"},{"v":4670.156469408224,"d":"4,670"},511,191,702,{"v":4173.6883985289205,"d":"4,174"},{"v":3801,"d":"3,801"},473,177,650,{"v":3519,"d":"3,519"},{"v":8733,"d":"8,733"}]
[null,"Dumfries & Galloway2012-13","Dumfries & Galloway","2012-13",940,360,360,310,{"v":1800,"d":"1,800"},{"v":1780,"d":"1,780"},{"v":18500,"d":"18,500"},{"v":10411.817898623183,"d":"10,412"},{"v":3860,"d":"3,860"},{"v":1422,"d":"1,422"},{"v":5282,"d":"5,282"},{"v":16849.093838935467,"d":"16,849"},{"v":15207,"d":"15,207"},{"v":3574,"d":"3,574"},{"v":1317,"d":"1,317"},{"v":4891,"d":"4,891"},{"v":14081,"d":"14,081"},{"v":34345,"d":"34,345"}]
[null,"Dundee City2012-13","Dundee City","2012-13",970,310,290,180,{"v":1530,"d":"1,530"},990,{"v":9000,"d":"9,000"},{"v":21115.71718918479,"d":"21,116"},{"v":2542,"d":"2,542"},631,{"v":3173,"d":"3,173"},{"v":14135.581836307041,"d":"14,136"},{"v":8717,"d":"8,717"},{"v":2380,"d":"2,380"},591,{"v":2971,"d":"2,971"},{"v":8003,"d":"8,003"},{"v":25147,"d":"25,147"}]
[null,"East Ayrshire2012-13","East Ayrshire","2012-13",710,170,170,100,{"v":1590,"d":"1,590"},{"v":1590,"d":"1,590"},{"v":11300,"d":"11,300"},{"v":14168.603868194843,"d":"14,169"},{"v":1539,"d":"1,539"},432,{"v":1971,"d":"1,971"},{"v":9663.357449856734,"d":"9,663"},{"v":8781,"d":"8,781"},{"v":1426,"d":"1,426"},400,{"v":1826,"d":"1,826"},{"v":6886,"d":"6,886"},{"v":22241,"d":"22,241"}]
[null,"East Dunbartonshire2012-13","East Dunbartonshire","2012-13",610,340,340,280,970,960,{"v":9100,"d":"9,100"},{"v":6079.683364839319,"d":"6,080"},{"v":3009,"d":"3,009"},{"v":1149,"d":"1,149"},{"v":4158,"d":"4,158"},{"v":9312.147069943288,"d":"9,312"},{"v":6625,"d":"6,625"},{"v":2866,"d":"2,866"},{"v":1094,"d":"1,094"},{"v":3960,"d":"3,960"},{"v":6145,"d":"6,145"},{"v":21453,"d":"21,453"}]
[null,"East Lothian2012-13","East Lothian","2012-13",580,220,220,170,{"v":1120,"d":"1,120"},{"v":1060,"d":"1,060"},{"v":9400,"d":"9,400"},{"v":16482,"d":"16,482"},{"v":1967,"d":"1,967"},661,{"v":2628,"d":"2,628"},{"v":4472,"d":"4,472"},{"v":4205,"d":"4,205"},{"v":1906,"d":"1,906"},640,{"v":2546,"d":"2,546"},{"v":4070,"d":"4,070"},{"v":18579,"d":"18,579"}]
[null,"East Renfrewshire2012-13","East Renfrewshire","2012-13",560,270,270,190,940,890,{"v":11200,"d":"11,200"},{"v":11618.372238305652,"d":"11,618"},{"v":4173,"d":"4,173"},{"v":1002,"d":"1,002"},{"v":5175,"d":"5,175"},{"v":6421.7103458784095,"d":"6,422"},{"v":5678,"d":"5,678"},{"v":3902,"d":"3,902"},879,{"v":4781,"d":"4,781"},{"v":4981,"d":"4,981"},{"v":16906,"d":"16,906"}]
[null,"Edinburgh, City of2012-13","Edinburgh, City of","2012-13",2710,1280,1270,860,{"v":3480,"d":"3,480"},{"v":3400,"d":"3,400"},{"v":33900,"d":"33,900"},{"v":51209.0933615222,"d":"51,209"},{"v":9817,"d":"9,817"},{"v":3215,"d":"3,215"},{"v":13032,"d":"13,032"},{"v":40860.029852008454,"d":"40,860"},{"v":32391,"d":"32,391"},{"v":9031,"d":"9,031"},{"v":2958,"d":"2,958"},{"v":11989,"d":"11,989"},{"v":29800,"d":"29,800"},{"v":70873,"d":"70,873"}]
[null,"Eilean Siar2012-13","Eilean Siar","2012-13",180,40,40,20,470,460,{"v":4000,"d":"4,000"},{"v":6609.280554828579,"d":"6,609"},334,53,387,{"v":4918.637529442554,"d":"4,919"},{"v":5135,"d":"5,135"},290,46,336,{"v":3940,"d":"3,940"},{"v":6176,"d":"6,176"}]
[null,"Falkirk2012-13","Falkirk","2012-13",790,160,160,140,{"v":1830,"d":"1,830"},{"v":1660,"d":"1,660"},{"v":10400,"d":"10,400"},{"v":14358.4673874302,"d":"14,358"},{"v":1228,"d":"1,228"},496,{"v":1724,"d":"1,724"},{"v":12848.531186883687,"d":"12,849"},{"v":9058,"d":"9,058"},{"v":1159,"d":"1,159"},468,{"v":1627,"d":"1,627"},{"v":8550,"d":"8,550"},{"v":26445,"d":"26,445"}]
[null,"Fife2012-13","Fife","2012-13",2120,750,750,390,{"v":3040,"d":"3,040"},{"v":2870,"d":"2,870"},{"v":20100,"d":"20,100"},{"v":44472.85225606456,"d":"44,473"},{"v":8040,"d":"8,040"},{"v":1921,"d":"1,921"},{"v":9961,"d":"9,961"},{"v":25248.813787334548,"d":"25,249"},{"v":25129,"d":"25,129"},{"v":7450,"d":"7,450"},{"v":1793,"d":"1,793"},{"v":9243,"d":"9,243"},{"v":23449,"d":"23,449"},{"v":67153,"d":"67,153"}]
[null,"Glasgow City2012-13","Glasgow City","2012-13",3900,660,660,370,{"v":5750,"d":"5,750"},{"v":5620,"d":"5,620"},{"v":55100,"d":"55,100"},{"v":81372.84399088666,"d":"81,373"},{"v":10806,"d":"10,806"},{"v":1781,"d":"1,781"},{"v":12587,"d":"12,587"},{"v":56404.01612872603,"d":"56,404"},{"v":55313,"d":"55,313"},{"v":5945,"d":"5,945"},{"v":1501,"d":"1,501"},{"v":7446,"d":"7,446"},{"v":50681,"d":"50,681"},{"v":82960,"d":"82,960"}]
[null,"Highland2012-13","Highland","2012-13",1470,380,380,120,{"v":1640,"d":"1,640"},{"v":1590,"d":"1,590"},{"v":10200,"d":"10,200"},{"v":29330.19932993223,"d":"29,330"},{"v":3221,"d":"3,221"},463,{"v":3684,"d":"3,684"},{"v":15762.33535368918,"d":"15,762"},{"v":13220,"d":"13,220"},{"v":2982,"d":"2,982"},429,{"v":3411,"d":"3,411"},{"v":12241,"d":"12,241"},{"v":45054,"d":"45,054"}]
[null,"Inverclyde2012-13","Inverclyde","2012-13",570,150,150,120,{"v":1160,"d":"1,160"},{"v":1120,"d":"1,120"},{"v":9400,"d":"9,400"},{"v":11219.720417335473,"d":"11,220"},{"v":1880,"d":"1,880"},724,{"v":2604,"d":"2,604"},{"v":8253.632712680577,"d":"8,254"},{"v":7798,"d":"7,798"},{"v":1710,"d":"1,710"},659,{"v":2369,"d":"2,369"},{"v":7096,"d":"7,096"},{"v":15200,"d":"15,200"}]
[null,"Midlothian2012-13","Midlothian","2012-13",380,80,80,60,810,770,{"v":9300,"d":"9,300"},{"v":9685.224270353303,"d":"9,685"},666,245,911,{"v":7238.748079877112,"d":"7,239"},{"v":5101,"d":"5,101"},646,238,884,{"v":4959,"d":"4,959"},{"v":14710,"d":"14,710"}]
[null,"Moray2012-13","Moray","2012-13",520,190,190,50,{"v":1050,"d":"1,050"},930,{"v":7400,"d":"7,400"},{"v":8296.287690021716,"d":"8,296"},{"v":2022,"d":"2,022"},303,{"v":2325,"d":"2,325"},{"v":9960.866841924792,"d":"9,961"},{"v":8955,"d":"8,955"},{"v":1747,"d":"1,747"},262,{"v":2009,"d":"2,009"},{"v":7247,"d":"7,247"},{"v":17958,"d":"17,958"}]
[null,"North Ayrshire2012-13","North Ayrshire","2012-13",890,350,350,220,{"v":1570,"d":"1,570"},{"v":1510,"d":"1,510"},{"v":13200,"d":"13,200"},{"v":17084.391237509608,"d":"17,084"},{"v":3113,"d":"3,113"},927,{"v":4040,"d":"4,040"},{"v":11593.584053542303,"d":"11,594"},{"v":11282,"d":"11,282"},{"v":2910,"d":"2,910"},867,{"v":3777,"d":"3,777"},{"v":10547,"d":"10,547"},{"v":27083,"d":"27,083"}]
[null,"North Lanarkshire2012-13","North Lanarkshire","2012-13",1320,230,230,200,{"v":2840,"d":"2,840"},{"v":2720,"d":"2,720"},{"v":23100,"d":"23,100"},{"v":31081.17194885703,"d":"31,081"},{"v":2051,"d":"2,051"},810,{"v":2861,"d":"2,861"},{"v":25716.699651297946,"d":"25,717"},{"v":21299,"d":"21,299"},{"v":1899,"d":"1,899"},750,{"v":2649,"d":"2,649"},{"v":16826,"d":"16,826"},{"v":52304,"d":"52,304"}]
[null,"Orkney Islands2012-13","Orkney Islands","2012-13",100,30,30,0,210,210,{"v":1200,"d":"1,200"},{"v":4933,"d":"4,933"},229,4,233,{"v":2092,"d":"2,092"},{"v":1493,"d":"1,493"},211,4,215,{"v":1383,"d":"1,383"},{"v":4450,"d":"4,450"}]
[null,"Perth & Kinross2012-13","Perth & Kinross","2012-13",940,350,350,150,{"v":1100,"d":"1,100"},{"v":1100,"d":"1,100"},{"v":8500,"d":"8,500"},{"v":17137.942898754518,"d":"17,138"},{"v":3213,"d":"3,213"},616,{"v":3829,"d":"3,829"},{"v":12227.25748292487,"d":"12,227"},{"v":8892,"d":"8,892"},{"v":2932,"d":"2,932"},562,{"v":3494,"d":"3,494"},{"v":8207,"d":"8,207"},{"v":30982,"d":"30,982"}]
[null,"Renfrewshire2012-13","Renfrewshire","2012-13",1040,230,230,170,{"v":1410,"d":"1,410"},{"v":1370,"d":"1,370"},{"v":9700,"d":"9,700"},{"v":19443.04291033749,"d":"19,443"},{"v":2202,"d":"2,202"},759,{"v":2961,"d":"2,961"},{"v":8726.913588273539,"d":"8,727"},{"v":7298,"d":"7,298"},{"v":2009,"d":"2,009"},693,{"v":2702,"d":"2,702"},{"v":6689,"d":"6,689"},{"v":30565,"d":"30,565"}]
[null,"Scottish Borders2012-13","Scottish Borders","2012-13",620,290,290,120,{"v":1270,"d":"1,270"},{"v":1250,"d":"1,250"},{"v":8500,"d":"8,500"},{"v":12765.375994022523,"d":"12,765"},{"v":2721,"d":"2,721"},562,{"v":3283,"d":"3,283"},{"v":7911.066712920959,"d":"7,911"},{"v":5892,"d":"5,892"},{"v":2483,"d":"2,483"},454,{"v":2937,"d":"2,937"},{"v":5290,"d":"5,290"},{"v":24937,"d":"24,937"}]
[null,"Shetland Islands2012-13","Shetland Islands","2012-13",90,10,10,0,400,220,{"v":1900,"d":"1,900"},{"v":7068.31274519666,"d":"7,068"},326,0,326,{"v":3990.9337088824063,"d":"3,991"},{"v":1938,"d":"1,938"},307,0,307,{"v":1816,"d":"1,816"},{"v":3985,"d":"3,985"}]
[null,"South Ayrshire2012-13","South Ayrshire","2012-13",850,390,390,340,{"v":1640,"d":"1,640"},{"v":1660,"d":"1,660"},{"v":16500,"d":"16,500"},{"v":17385.539407086046,"d":"17,386"},{"v":4172,"d":"4,172"},{"v":1505,"d":"1,505"},{"v":5677,"d":"5,677"},{"v":10893.885079187367,"d":"10,894"},{"v":11758,"d":"11,758"},{"v":4051,"d":"4,051"},{"v":1461,"d":"1,461"},{"v":5512,"d":"5,512"},{"v":11416,"d":"11,416"},{"v":25259,"d":"25,259"}]
[null,"South Lanarkshire2012-13","South Lanarkshire","2012-13",1680,480,480,360,{"v":2920,"d":"2,920"},{"v":2790,"d":"2,790"},{"v":25800,"d":"25,800"},{"v":36869.27781671537,"d":"36,869"},{"v":4341,"d":"4,341"},{"v":1458,"d":"1,458"},{"v":5799,"d":"5,799"},{"v":20026.348745430823,"d":"20,026"},{"v":13813,"d":"13,813"},{"v":4219,"d":"4,219"},{"v":1417,"d":"1,417"},{"v":5636,"d":"5,636"},{"v":13424,"d":"13,424"},{"v":55017,"d":"55,017"}]
[null,"Stirling2012-13","Stirling","2012-13",450,180,180,120,870,790,{"v":7300,"d":"7,300"},{"v":9984.312137310993,"d":"9,984"},{"v":1994,"d":"1,994"},594,{"v":2588,"d":"2,588"},{"v":5523.003718839395,"d":"5,523"},{"v":5132,"d":"5,132"},{"v":1881,"d":"1,881"},560,{"v":2441,"d":"2,441"},{"v":4840,"d":"4,840"},{"v":16274,"d":"16,274"}]
[null,"West Dunbartonshire2012-13","West Dunbartonshire","2012-13",530,90,90,40,{"v":1270,"d":"1,270"},{"v":1040,"d":"1,040"},{"v":7900,"d":"7,900"},{"v":12171.794439352276,"d":"12,172"},753,115,868,{"v":6870.4602505346775,"d":"6,870"},{"v":6236,"d":"6,236"},697,107,804,{"v":5775,"d":"5,775"},{"v":15262,"d":"15,262"}]
[null,"West Lothian2012-13","West Lothian","2012-13",690,160,160,130,{"v":1400,"d":"1,400"},{"v":1300,"d":"1,300"},{"v":8900,"d":"8,900"},{"v":13093.69806416678,"d":"13,094"},{"v":1427,"d":"1,427"},585,{"v":2012,"d":"2,012"},{"v":11758.057398131854,"d":"11,758"},{"v":5452,"d":"5,452"},{"v":1377,"d":"1,377"},564,{"v":1941,"d":"1,941"},{"v":5262,"d":"5,262"},{"v":25216,"d":"25,216"}]
[null,"Scotland2012-13","Scotland","2012-13",30260,9580,9520,{"v":6130,"d":"6,130"},{"v":50370,"d":"50,370"},{"v":47170,"d":"47,170"},{"v":400500,"d":"400,500"},{"v":625264.638822167,"d":"625,265"},{"v":93186,"d":"93,186"},{"v":25547,"d":"25,547"},{"v":118733,"d":"118,733"},{"v":423133.3888687028,"d":"423,133"},{"v":351098,"d":"351,098"},{"v":82978,"d":"82,978"},{"v":23681,"d":"23,681"},{"v":106659,"d":"106,659"},{"v":320870,"d":"320,870"},{"v":925741,"d":"925,741"}]
[null,"Aberdeen City2013-14","Aberdeen City","2013-14",1340,410,400,260,{"v":1590,"d":"1,590"},{"v":1560,"d":"1,560"},{"v":11700,"d":"11,700"},{"v":27885.381847843502,"d":"27,885"},{"v":3441,"d":"3,441"},{"v":1095,"d":"1,095"},{"v":4536,"d":"4,536"},{"v":15796.478711782442,"d":"15,796"},{"v":9853,"d":"9,853"},{"v":3296,"d":"3,296"},{"v":1042,"d":"1,042"},{"v":4338,"d":"4,338"},{"v":9381,"d":"9,381"},{"v":33710,"d":"33,710"}]
[null,"Aberdeenshire2013-14","Aberdeenshire","2013-14",1410,490,490,320,{"v":1860,"d":"1,860"},{"v":1810,"d":"1,810"},{"v":13200,"d":"13,200"},{"v":28845.522625441383,"d":"28,846"},{"v":4213,"d":"4,213"},{"v":1236,"d":"1,236"},{"v":5449,"d":"5,449"},{"v":17529.403890092282,"d":"17,529"},{"v":15153,"d":"15,153"},{"v":3947,"d":"3,947"},{"v":1158,"d":"1,158"},{"v":5105,"d":"5,105"},{"v":14685,"d":"14,685"},{"v":44383,"d":"44,383"}]
[null,"Angus2013-14","Angus","2013-14",730,230,230,90,{"v":1540,"d":"1,540"},{"v":1140,"d":"1,140"},{"v":6400,"d":"6,400"},{"v":15829.684799792665,"d":"15,830"},{"v":1940,"d":"1,940"},357,{"v":2297,"d":"2,297"},{"v":7157.394531553713,"d":"7,157"},{"v":5163,"d":"5,163"},{"v":1871,"d":"1,871"},344,{"v":2215,"d":"2,215"},{"v":5032,"d":"5,032"},{"v":24976,"d":"24,976"}]
[null,"Argyll & Bute2013-14","Argyll & Bute","2013-14",510,150,150,60,{"v":1080,"d":"1,080"},{"v":1080,"d":"1,080"},{"v":11500,"d":"11,500"},{"v":12015.30527839854,"d":"12,015"},{"v":1513,"d":"1,513"},273,{"v":1786,"d":"1,786"},{"v":12123.36637184854,"d":"12,123"},{"v":9609,"d":"9,609"},{"v":1427,"d":"1,427"},257,{"v":1684,"d":"1,684"},{"v":8924,"d":"8,924"},{"v":20631,"d":"20,631"}]
[null,"Clackmannanshire2013-14","Clackmannanshire","2013-14",210,50,50,40,540,530,{"v":4800,"d":"4,800"},{"v":5154.051249199231,"d":"5,154"},447,185,632,{"v":4152.800768737989,"d":"4,153"},{"v":3812,"d":"3,812"},414,171,585,{"v":3529,"d":"3,529"},{"v":9021,"d":"9,021"}]
[null,"Dumfries & Galloway2013-14","Dumfries & Galloway","2013-14",960,410,410,340,{"v":1580,"d":"1,580"},{"v":1560,"d":"1,560"},{"v":15200,"d":"15,200"},{"v":12115.40335031944,"d":"12,115"},{"v":4070,"d":"4,070"},{"v":1492,"d":"1,492"},{"v":5562,"d":"5,562"},{"v":16501.766371311227,"d":"16,502"},{"v":14701,"d":"14,701"},{"v":3769,"d":"3,769"},{"v":1381,"d":"1,381"},{"v":5150,"d":"5,150"},{"v":13612,"d":"13,612"},{"v":35046,"d":"35,046"}]
[null,"Dundee City2013-14","Dundee City","2013-14",1060,330,310,190,{"v":1640,"d":"1,640"},{"v":1060,"d":"1,060"},{"v":9800,"d":"9,800"},{"v":21774.417023233495,"d":"21,774"},{"v":2706,"d":"2,706"},701,{"v":3407,"d":"3,407"},{"v":12841.441816291439,"d":"12,841"},{"v":9976,"d":"9,976"},{"v":2545,"d":"2,545"},659,{"v":3204,"d":"3,204"},{"v":9174,"d":"9,174"},{"v":25442,"d":"25,442"}]
[null,"East Ayrshire2013-14","East Ayrshire","2013-14",800,190,190,120,{"v":1620,"d":"1,620"},{"v":1620,"d":"1,620"},{"v":11900,"d":"11,900"},{"v":13712.386189883002,"d":"13,712"},{"v":1684,"d":"1,684"},482,{"v":2166,"d":"2,166"},{"v":10805.072250311423,"d":"10,805"},{"v":9234,"d":"9,234"},{"v":1559,"d":"1,559"},446,{"v":2005,"d":"2,005"},{"v":7242,"d":"7,242"},{"v":22800,"d":"22,800"}]
[null,"East Dunbartonshire2013-14","East Dunbartonshire","2013-14",650,380,380,320,{"v":1050,"d":"1,050"},{"v":1050,"d":"1,050"},{"v":10000,"d":"10,000"},{"v":6864.995605350848,"d":"6,865"},{"v":3269,"d":"3,269"},{"v":1292,"d":"1,292"},{"v":4561,"d":"4,561"},{"v":10201.198918240209,"d":"10,201"},{"v":7335,"d":"7,335"},{"v":3113,"d":"3,113"},{"v":1231,"d":"1,231"},{"v":4344,"d":"4,344"},{"v":6804,"d":"6,804"},{"v":21988,"d":"21,988"}]
[null,"East Lothian2013-14","East Lothian","2013-14",600,220,220,170,{"v":1140,"d":"1,140"},{"v":1090,"d":"1,090"},{"v":10000,"d":"10,000"},{"v":13178.173673328738,"d":"13,178"},{"v":1927,"d":"1,927"},650,{"v":2577,"d":"2,577"},{"v":7529.030323914541,"d":"7,529"},{"v":5601,"d":"5,601"},{"v":1870,"d":"1,870"},631,{"v":2501,"d":"2,501"},{"v":5436,"d":"5,436"},{"v":19106,"d":"19,106"}]
[null,"East Renfrewshire2013-14","East Renfrewshire","2013-14",570,260,260,170,910,890,{"v":6700,"d":"6,700"},{"v":11789.023498299963,"d":"11,789"},{"v":4035,"d":"4,035"},892,{"v":4927,"d":"4,927"},{"v":6660.261428031734,"d":"6,660"},{"v":5127,"d":"5,127"},{"v":3974,"d":"3,974"},892,{"v":4866,"d":"4,866"},{"v":4975,"d":"4,975"},{"v":17263,"d":"17,263"}]
[null,"Edinburgh, City of2013-14","Edinburgh, City of","2013-14",2660,1250,1250,760,{"v":3520,"d":"3,520"},{"v":3450,"d":"3,450"},{"v":39700,"d":"39,700"},{"v":57211.569371538644,"d":"57,212"},{"v":10046,"d":"10,046"},{"v":3276,"d":"3,276"},{"v":13322,"d":"13,322"},{"v":46050.54423308452,"d":"46,051"},{"v":34988,"d":"34,988"},{"v":9242,"d":"9,242"},{"v":3014,"d":"3,014"},{"v":12256,"d":"12,256"},{"v":32189,"d":"32,189"},{"v":72208,"d":"72,208"}]
[null,"Eilean Siar2013-14","Eilean Siar","2013-14",180,40,40,20,450,440,{"v":4100,"d":"4,100"},{"v":6490.138455686572,"d":"6,490"},418,85,503,{"v":5354.130848231267,"d":"5,354"},{"v":5093,"d":"5,093"},363,74,437,{"v":3877,"d":"3,877"},{"v":6270,"d":"6,270"}]
[null,"Falkirk2013-14","Falkirk","2013-14",850,180,180,160,{"v":1900,"d":"1,900"},{"v":1740,"d":"1,740"},{"v":11700,"d":"11,700"},{"v":13925.90508034162,"d":"13,926"},{"v":1958,"d":"1,958"},715,{"v":2673,"d":"2,673"},{"v":12730.43535413363,"d":"12,730"},{"v":9221,"d":"9,221"},{"v":1848,"d":"1,848"},675,{"v":2523,"d":"2,523"},{"v":8704,"d":"8,704"},{"v":27186,"d":"27,186"}]
[null,"Fife2013-14","Fife","2013-14",2140,810,810,400,{"v":2740,"d":"2,740"},{"v":2580,"d":"2,580"},{"v":18800,"d":"18,800"},{"v":45349.760416666664,"d":"45,350"},{"v":7924,"d":"7,924"},{"v":1943,"d":"1,943"},{"v":9867,"d":"9,867"},{"v":22216.077083333334,"d":"22,216"},{"v":17212,"d":"17,212"},{"v":7365,"d":"7,365"},{"v":1802,"d":"1,802"},{"v":9167,"d":"9,167"},{"v":15955,"d":"15,955"},{"v":69017,"d":"69,017"}]
[null,"Glasgow City2013-14","Glasgow City","2013-14",3800,680,680,400,{"v":5370,"d":"5,370"},{"v":5290,"d":"5,290"},{"v":51900,"d":"51,900"},{"v":71485.59710974986,"d":"71,486"},{"v":11509,"d":"11,509"},{"v":1566,"d":"1,566"},{"v":13075,"d":"13,075"},{"v":57564.31648618407,"d":"57,564"},{"v":51247,"d":"51,247"},{"v":5266,"d":"5,266"},{"v":1271,"d":"1,271"},{"v":6537,"d":"6,537"},{"v":46092,"d":"46,092"},{"v":83197,"d":"83,197"}]
[null,"Highland2013-14","Highland","2013-14",1490,390,390,120,{"v":1750,"d":"1,750"},{"v":1710,"d":"1,710"},{"v":11300,"d":"11,300"},{"v":35934.866041178,"d":"35,935"},{"v":3536,"d":"3,536"},484,{"v":4020,"d":"4,020"},{"v":18075.45139431848,"d":"18,075"},{"v":13282,"d":"13,282"},{"v":3274,"d":"3,274"},448,{"v":3722,"d":"3,722"},{"v":12298,"d":"12,298"},{"v":46550,"d":"46,550"}]
[null,"Inverclyde2013-14","Inverclyde","2013-14",600,160,150,130,{"v":1140,"d":"1,140"},{"v":1100,"d":"1,100"},{"v":8600,"d":"8,600"},{"v":11671.488966691293,"d":"11,671"},{"v":2168,"d":"2,168"},834,{"v":3002,"d":"3,002"},{"v":8486.316159701924,"d":"8,486"},{"v":8125,"d":"8,125"},{"v":1972,"d":"1,972"},759,{"v":2731,"d":"2,731"},{"v":7394,"d":"7,394"},{"v":15423,"d":"15,423"}]
[null,"Midlothian2013-14","Midlothian","2013-14",380,90,90,70,770,760,{"v":6100,"d":"6,100"},{"v":9388.047774504339,"d":"9,388"},762,255,{"v":1017,"d":"1,017"},{"v":7933.71677681344,"d":"7,934"},{"v":5083,"d":"5,083"},738,246,984,{"v":4917,"d":"4,917"},{"v":15143,"d":"15,143"}]
[null,"Moray2013-14","Moray","2013-14",540,180,180,50,{"v":1070,"d":"1,070"},900,{"v":8200,"d":"8,200"},{"v":8296.349563139422,"d":"8,296"},{"v":2310,"d":"2,310"},257,{"v":2567,"d":"2,567"},{"v":10361.057538645358,"d":"10,361"},{"v":9571,"d":"9,571"},{"v":2011,"d":"2,011"},224,{"v":2235,"d":"2,235"},{"v":7666,"d":"7,666"},{"v":18488,"d":"18,488"}]
[null,"North Ayrshire2013-14","North Ayrshire","2013-14",910,470,470,240,{"v":1630,"d":"1,630"},{"v":1620,"d":"1,620"},{"v":15700,"d":"15,700"},{"v":16331.48489965693,"d":"16,331"},{"v":3194,"d":"3,194"},979,{"v":4173,"d":"4,173"},{"v":14373.972838935599,"d":"14,374"},{"v":13528,"d":"13,528"},{"v":3055,"d":"3,055"},936,{"v":3991,"d":"3,991"},{"v":12914,"d":"12,914"},{"v":27819,"d":"27,819"}]
[null,"North Lanarkshire2013-14","North Lanarkshire","2013-14",1360,250,250,210,{"v":2960,"d":"2,960"},{"v":2850,"d":"2,850"},{"v":25100,"d":"25,100"},{"v":31077.28775530994,"d":"31,077"},{"v":2155,"d":"2,155"},877,{"v":3032,"d":"3,032"},{"v":27765.065094483776,"d":"27,765"},{"v":23307,"d":"23,307"},{"v":1995,"d":"1,995"},812,{"v":2807,"d":"2,807"},{"v":18413,"d":"18,413"},{"v":53498,"d":"53,498"}]
[null,"Orkney Islands2013-14","Orkney Islands","2013-14",100,20,20,0,240,240,{"v":1500,"d":"1,500"},{"v":4335,"d":"4,335"},243,4,247,{"v":1955,"d":"1,955"},{"v":1574,"d":"1,574"},224,4,228,{"v":1458,"d":"1,458"},{"v":4560,"d":"4,560"}]
[null,"Perth & Kinross2013-14","Perth & Kinross","2013-14",960,370,370,160,{"v":1230,"d":"1,230"},{"v":1230,"d":"1,230"},{"v":9000,"d":"9,000"},{"v":16931.6850585692,"d":"16,932"},{"v":3395,"d":"3,395"},659,{"v":4054,"d":"4,054"},{"v":11215.925443667991,"d":"11,216"},{"v":8967,"d":"8,967"},{"v":3098,"d":"3,098"},601,{"v":3699,"d":"3,699"},{"v":7993,"d":"7,993"},{"v":31734,"d":"31,734"}]
[null,{"$f":"C226&D226","v":"Renfrewshire2013-14"},"Renfrewshire","2013-14",1040,230,230,170,{"v":1520,"d":"1,520"},{"v":1490,"d":"1,490"},{"v":10700,"d":"10,700"},{"v":21645.859316569957,"d":"21,646"},{"v":1983,"d":"1,983"},655,{"v":2638,"d":"2,638"},{"v":9180.65892972276,"d":"9,181"},{"v":8293,"d":"8,293"},{"v":1809,"d":"1,809"},598,{"v":2407,"d":"2,407"},{"v":7740,"d":"7,740"},{"v":31075,"d":"31,075"}]
[null,"Scottish Borders2013-14","Scottish Borders","2013-14",660,290,280,110,{"v":1260,"d":"1,260"},{"v":1240,"d":"1,240"},{"v":8000,"d":"8,000"},{"v":13036.05479271539,"d":"13,036"},{"v":2730,"d":"2,730"},471,{"v":3201,"d":"3,201"},{"v":7988.281474843845,"d":"7,988"},{"v":6176,"d":"6,176"},{"v":2485,"d":"2,485"},429,{"v":2914,"d":"2,914"},{"v":5545,"d":"5,545"},{"v":25713,"d":"25,713"}]
[null,"Shetland Islands2013-14","Shetland Islands","2013-14",90,20,20,0,340,220,{"v":1800,"d":"1,800"},{"v":5204.245888487766,"d":"5,204"},150,0,150,{"v":3979.0756976677553,"d":"3,979"},{"v":3024,"d":"3,024"},148,0,148,{"v":2988,"d":"2,988"},{"v":4107,"d":"4,107"}]
[null,"South Ayrshire2013-14","South Ayrshire","2013-14",840,380,380,340,{"v":1460,"d":"1,460"},{"v":1460,"d":"1,460"},{"v":13900,"d":"13,900"},{"v":17208.7769350579,"d":"17,209"},{"v":4184,"d":"4,184"},{"v":1471,"d":"1,471"},{"v":5655,"d":"5,655"},{"v":11391.241484390872,"d":"11,391"},{"v":12361,"d":"12,361"},{"v":4068,"d":"4,068"},{"v":1430,"d":"1,430"},{"v":5498,"d":"5,498"},{"v":12018,"d":"12,018"},{"v":25827,"d":"25,827"}]
[null,"South Lanarkshire2013-14","South Lanarkshire","2013-14",1680,470,460,340,{"v":2910,"d":"2,910"},{"v":2820,"d":"2,820"},{"v":26300,"d":"26,300"},{"v":37001.28057162585,"d":"37,001"},{"v":4380,"d":"4,380"},{"v":1431,"d":"1,431"},{"v":5811,"d":"5,811"},{"v":22012.289892977078,"d":"22,012"},{"v":14242,"d":"14,242"},{"v":4257,"d":"4,257"},{"v":1391,"d":"1,391"},{"v":5648,"d":"5,648"},{"v":13841,"d":"13,841"},{"v":56381,"d":"56,381"}]
[null,"Stirling2013-14","Stirling","2013-14",460,180,180,110,860,780,{"v":7200,"d":"7,200"},{"v":10415.541800015611,"d":"10,416"},{"v":2088,"d":"2,088"},506,{"v":2594,"d":"2,594"},{"v":6456.936148622278,"d":"6,457"},{"v":4743,"d":"4,743"},{"v":1970,"d":"1,970"},477,{"v":2447,"d":"2,447"},{"v":4473,"d":"4,473"},{"v":16587,"d":"16,587"}]
[null,"West Dunbartonshire2013-14","West Dunbartonshire","2013-14",560,90,90,40,{"v":1290,"d":"1,290"},{"v":1070,"d":"1,070"},{"v":8000,"d":"8,000"},{"v":12511.9023425782,"d":"12,512"},770,185,955,{"v":7228.262128773624,"d":"7,228"},{"v":6599,"d":"6,599"},712,171,883,{"v":6104,"d":"6,104"},{"v":15515,"d":"15,515"}]
[null,"West Lothian2013-14","West Lothian","2013-14",690,190,190,150,{"v":1490,"d":"1,490"},{"v":1430,"d":"1,430"},{"v":10600,"d":"10,600"},{"v":13830.473109009306,"d":"13,830"},{"v":1485,"d":"1,485"},604,{"v":2089,"d":"2,089"},{"v":11649.261860689201,"d":"11,649"},{"v":6228,"d":"6,228"},{"v":1433,"d":"1,433"},583,{"v":2016,"d":"2,016"},{"v":6010,"d":"6,010"},{"v":26234,"d":"26,234"}]
[null,"Scotland2013-14","Scotland","2013-14",30800,9840,9780,{"v":6030,"d":"6,030"},{"v":50450,"d":"50,450"},{"v":47810,"d":"47,810"},{"v":409500,"d":"409,500"},{"v":627227.7594116986,"d":"627,228"},{"v":96633,"d":"96,633"},{"v":25912,"d":"25,912"},{"v":122545,"d":"122,545"},{"v":445266.23225133633,"d":"445,266"},{"v":358428,"d":"358,428"},{"v":85118,"d":"85,118"},{"v":24157,"d":"24,157"},{"v":109275,"d":"109,275"},{"v":327383,"d":"327,383"},{"v":946898,"d":"946,898"}]
[null,"Aberdeen City2014-15","Aberdeen City","2014-15",{"v":1350,"d":"1,350"},420,420,290,{"v":1500,"d":"1,500"},{"v":1490,"d":"1,490"},{"v":11900,"d":"11,900"},{"v":27646.56377502383,"d":"27,647"},{"v":3385,"d":"3,385"},{"v":1039,"d":"1,039"},{"v":4424,"d":"4,424"},{"v":15968.091061083816,"d":"15,968"},{"v":9833,"d":"9,833"},{"v":3370,"d":"3,370"},{"v":1034,"d":"1,034"},{"v":4404,"d":"4,404"},{"v":9526,"d":"9,526"},{"v":34262,"d":"34,262"}]
[null,"Aberdeenshire2014-15","Aberdeenshire","2014-15",{"v":1410,"d":"1,410"},470,470,290,{"v":1810,"d":"1,810"},{"v":1770,"d":"1,770"},{"v":13400,"d":"13,400"},{"v":27865.248254102364,"d":"27,865"},{"v":4399,"d":"4,399"},{"v":1243,"d":"1,243"},{"v":5642,"d":"5,642"},{"v":17911.823205586872,"d":"17,912"},{"v":16581,"d":"16,581"},{"v":4121,"d":"4,121"},{"v":1165,"d":"1,165"},{"v":5286,"d":"5,286"},{"v":16069,"d":"16,069"},{"v":45790,"d":"45,790"}]
[null,"Angus2014-15","Angus","2014-15",710,230,230,100,{"v":1780,"d":"1,780"},680,{"v":3900,"d":"3,900"},{"v":15710.302431766879,"d":"15,710"},{"v":1848,"d":"1,848"},346,{"v":2194,"d":"2,194"},{"v":6754.334804022163,"d":"6,754"},{"v":3392,"d":"3,392"},{"v":1782,"d":"1,782"},334,{"v":2116,"d":"2,116"},{"v":3306,"d":"3,306"},{"v":25645,"d":"25,645"}]
[null,"Argyll & Bute2014-15","Argyll & Bute","2014-15",510,170,170,70,{"v":1100,"d":"1,100"},{"v":1100,"d":"1,100"},{"v":11100,"d":"11,100"},{"v":12783.483750634157,"d":"12,783"},{"v":1532,"d":"1,532"},278,{"v":1810,"d":"1,810"},{"v":12655.650273060968,"d":"12,656"},{"v":10896,"d":"10,896"},{"v":1445,"d":"1,445"},262,{"v":1707,"d":"1,707"},{"v":10119,"d":"10,119"},{"v":21116,"d":"21,116"}]
[null,"Clackmannanshire2014-15","Clackmannanshire","2014-15",200,50,50,40,480,470,{"v":4700,"d":"4,700"},{"v":4895.315192743764,"d":"4,895"},469,195,664,{"v":3808.0450275348235,"d":"3,808"},{"v":3489,"d":"3,489"},434,181,615,{"v":3230,"d":"3,230"},{"v":9328,"d":"9,328"}]
[null,"Dumfries & Galloway2014-15","Dumfries & Galloway","2014-15",{"v":1000,"d":"1,000"},480,480,400,{"v":1680,"d":"1,680"},{"v":1570,"d":"1,570"},{"v":20600,"d":"20,600"},{"v":12499.177749504173,"d":"12,499"},{"v":3762,"d":"3,762"},{"v":1393,"d":"1,393"},{"v":5155,"d":"5,155"},{"v":16830.853309882874,"d":"16,831"},{"v":16897,"d":"16,897"},{"v":3483,"d":"3,483"},{"v":1290,"d":"1,290"},{"v":4773,"d":"4,773"},{"v":15645,"d":"15,645"},{"v":35785,"d":"35,785"}]
[null,"Dundee City2014-15","Dundee City","2014-15",{"v":1050,"d":"1,050"},340,330,180,{"v":1620,"d":"1,620"},{"v":1140,"d":"1,140"},{"v":9600,"d":"9,600"},{"v":22396.366927535666,"d":"22,396"},{"v":2896,"d":"2,896"},746,{"v":3642,"d":"3,642"},{"v":11836.523702648374,"d":"11,837"},{"v":9720,"d":"9,720"},{"v":2723,"d":"2,723"},701,{"v":3424,"d":"3,424"},{"v":8969,"d":"8,969"},{"v":25792,"d":"25,792"}]
[null,"East Ayrshire2014-15","East Ayrshire","2014-15",720,200,190,130,{"v":1540,"d":"1,540"},{"v":1530,"d":"1,530"},{"v":11300,"d":"11,300"},{"v":13931.211505674899,"d":"13,931"},{"v":1938,"d":"1,938"},581,{"v":2519,"d":"2,519"},{"v":10706.143553022554,"d":"10,706"},{"v":8848,"d":"8,848"},{"v":1795,"d":"1,795"},538,{"v":2333,"d":"2,333"},{"v":6930,"d":"6,930"},{"v":23207,"d":"23,207"}]
[null,"East Dunbartonshire2014-15","East Dunbartonshire","2014-15",640,390,390,340,{"v":1060,"d":"1,060"},{"v":1040,"d":"1,040"},{"v":9700,"d":"9,700"},{"v":7768.379119418852,"d":"7,768"},{"v":3579,"d":"3,579"},{"v":1434,"d":"1,434"},{"v":5013,"d":"5,013"},{"v":11050.148897058823,"d":"11,050"},{"v":7018,"d":"7,018"},{"v":3409,"d":"3,409"},{"v":1366,"d":"1,366"},{"v":4775,"d":"4,775"},{"v":6510,"d":"6,510"},{"v":22609,"d":"22,609"}]
[null,"East Lothian2014-15","East Lothian","2014-15",570,220,210,160,{"v":1160,"d":"1,160"},{"v":1120,"d":"1,120"},{"v":10000,"d":"10,000"},{"v":13105.869736103312,"d":"13,106"},{"v":1977,"d":"1,977"},655,{"v":2632,"d":"2,632"},{"v":8347.63840539023,"d":"8,348"},{"v":6514,"d":"6,514"},{"v":1907,"d":"1,907"},632,{"v":2539,"d":"2,539"},{"v":6285,"d":"6,285"},{"v":19504,"d":"19,504"}]
[null,"East Renfrewshire2014-15","East Renfrewshire","2014-15",570,260,260,170,910,890,{"v":5700,"d":"5,700"},{"v":11588.338603818616,"d":"11,588"},{"v":4071,"d":"4,071"},906,{"v":4977,"d":"4,977"},{"v":6325.813767899761,"d":"6,326"},{"v":4977,"d":"4,977"},{"v":3961,"d":"3,961"},882,{"v":4843,"d":"4,843"},{"v":4843,"d":"4,843"},{"v":17689,"d":"17,689"}]
[null,"Edinburgh, City of2014-15","Edinburgh, City of","2014-15",{"v":2620,"d":"2,620"},1260,1250,680,{"v":3600,"d":"3,600"},{"v":3480,"d":"3,480"},{"v":36300,"d":"36,300"},{"v":56484.615741945076,"d":"56,485"},{"v":10082,"d":"10,082"},{"v":3333,"d":"3,333"},{"v":13415,"d":"13,415"},{"v":51757.03283659742,"d":"51,757"},{"v":38800,"d":"38,800"},{"v":9276,"d":"9,276"},{"v":3068,"d":"3,068"},{"v":12344,"d":"12,344"},{"v":35696,"d":"35,696"},{"v":73782,"d":"73,782"}]
[null,"Eilean Siar2014-15","Eilean Siar","2014-15",180,50,50,30,440,440,{"v":3900,"d":"3,900"},{"v":6374.4437594439405,"d":"6,374"},546,120,666,{"v":5577.772620126927,"d":"5,578"},{"v":5568,"d":"5,568"},475,104,579,{"v":4283,"d":"4,283"},{"v":6451,"d":"6,451"}]
[null,"Falkirk2014-15","Falkirk","2014-15",860,170,170,150,{"v":1820,"d":"1,820"},{"v":1660,"d":"1,660"},{"v":11100,"d":"11,100"},{"v":15113.194359387591,"d":"15,113"},{"v":2242,"d":"2,242"},832,{"v":3074,"d":"3,074"},{"v":8784.543835616438,"d":"8,785"},{"v":7037,"d":"7,037"},{"v":2123,"d":"2,123"},788,{"v":2911,"d":"2,911"},{"v":6511,"d":"6,511"},{"v":27944,"d":"27,944"}]
[null,"Fife2014-15","Fife","2014-15",{"v":2210,"d":"2,210"},850,850,420,{"v":2530,"d":"2,530"},{"v":2290,"d":"2,290"},{"v":17600,"d":"17,600"},{"v":47102.60979091119,"d":"47,103"},{"v":8868,"d":"8,868"},{"v":2093,"d":"2,093"},{"v":10961,"d":"10,961"},{"v":23255.12112298434,"d":"23,255"},{"v":19689,"d":"19,689"},{"v":8245,"d":"8,245"},{"v":1946,"d":"1,946"},{"v":10191,"d":"10,191"},{"v":18306,"d":"18,306"},{"v":71077,"d":"71,077"}]
[null,"Glasgow City2014-15","Glasgow City","2014-15",{"v":3570,"d":"3,570"},660,660,350,{"v":5710,"d":"5,710"},{"v":5380,"d":"5,380"},{"v":47300,"d":"47,300"},{"v":75354.76072897742,"d":"75,355"},{"v":11724,"d":"11,724"},{"v":1490,"d":"1,490"},{"v":13214,"d":"13,214"},{"v":53994.62375389481,"d":"53,995"},{"v":48050,"d":"48,050"},{"v":5438,"d":"5,438"},{"v":1212,"d":"1,212"},{"v":6650,"d":"6,650"},{"v":43216,"d":"43,216"},{"v":83546,"d":"83,546"}]
[null,"Highland2014-15","Highland","2014-15",{"v":1560,"d":"1,560"},410,410,140,{"v":1670,"d":"1,670"},{"v":1640,"d":"1,640"},{"v":11600,"d":"11,600"},{"v":34383.736367539714,"d":"34,384"},{"v":4257,"d":"4,257"},579,{"v":4836,"d":"4,836"},{"v":19384.3688278231,"d":"19,384"},{"v":16410,"d":"16,410"},{"v":3942,"d":"3,942"},536,{"v":4478,"d":"4,478"},{"v":15194,"d":"15,194"},{"v":48035,"d":"48,035"}]
[null,"Inverclyde2014-15","Inverclyde","2014-15",680,170,160,140,{"v":1070,"d":"1,070"},{"v":1030,"d":"1,030"},{"v":7800,"d":"7,800"},{"v":11975.926763945326,"d":"11,976"},{"v":2462,"d":"2,462"},817,{"v":3279,"d":"3,279"},{"v":8887.562984854081,"d":"8,888"},{"v":8458,"d":"8,458"},{"v":2240,"d":"2,240"},743,{"v":2983,"d":"2,983"},{"v":7697,"d":"7,697"},{"v":15691,"d":"15,691"}]
[null,"Midlothian2014-15","Midlothian","2014-15",410,100,100,80,650,650,{"v":5100,"d":"5,100"},{"v":8715.347450302506,"d":"8,715"},881,288,{"v":1169,"d":"1,169"},{"v":7323.95022393337,"d":"7,324"},{"v":4693,"d":"4,693"},837,274,{"v":1111,"d":"1,111"},{"v":4458,"d":"4,458"},{"v":15602,"d":"15,602"}]
[null,"Moray2014-15","Moray","2014-15",490,180,180,50,{"v":1010,"d":"1,010"},930,{"v":8600,"d":"8,600"},{"v":7972.308008746248,"d":"7,972"},{"v":2031,"d":"2,031"},243,{"v":2274,"d":"2,274"},{"v":10618.005744357559,"d":"10,618"},{"v":9925,"d":"9,925"},{"v":1821,"d":"1,821"},218,{"v":2039,"d":"2,039"},{"v":7753,"d":"7,753"},{"v":19008,"d":"19,008"}]
[null,"North Ayrshire2014-15","North Ayrshire","2014-15",920,340,340,220,{"v":1680,"d":"1,680"},{"v":1680,"d":"1,680"},{"v":16500,"d":"16,500"},{"v":16867.732540284862,"d":"16,868"},{"v":3068,"d":"3,068"},937,{"v":4005,"d":"4,005"},{"v":13834.625602287368,"d":"13,835"},{"v":12565,"d":"12,565"},{"v":2925,"d":"2,925"},894,{"v":3819,"d":"3,819"},{"v":11885,"d":"11,885"},{"v":28497,"d":"28,497"}]
[null,"North Lanarkshire2014-15","North Lanarkshire","2014-15",{"v":1290,"d":"1,290"},240,240,210,{"v":3120,"d":"3,120"},{"v":3040,"d":"3,040"},{"v":27000,"d":"27,000"},{"v":30558.41925648505,"d":"30,558"},{"v":2225,"d":"2,225"},933,{"v":3158,"d":"3,158"},{"v":31785.255320681335,"d":"31,785"},{"v":26260,"d":"26,260"},{"v":2060,"d":"2,060"},864,{"v":2924,"d":"2,924"},{"v":20745,"d":"20,745"},{"v":54784,"d":"54,784"}]
[null,"Orkney Islands2014-15","Orkney Islands","2014-15",100,20,20,0,240,240,{"v":1500,"d":"1,500"},{"v":4724,"d":"4,724"},263,5,268,{"v":2126,"d":"2,126"},{"v":1712,"d":"1,712"},242,5,247,{"v":1586,"d":"1,586"},{"v":4715,"d":"4,715"}]
[null,"Perth & Kinross2014-15","Perth & Kinross","2014-15",940,380,380,150,{"v":1200,"d":"1,200"},{"v":1080,"d":"1,080"},{"v":8600,"d":"8,600"},{"v":15591.598440775373,"d":"15,592"},{"v":3094,"d":"3,094"},588,{"v":3682,"d":"3,682"},{"v":10395.235979932637,"d":"10,395"},{"v":6998,"d":"6,998"},{"v":2941,"d":"2,941"},559,{"v":3500,"d":"3,500"},{"v":6653,"d":"6,653"},{"v":32516,"d":"32,516"}]
[null,"Renfrewshire2014-15","Renfrewshire","2014-15",990,220,220,160,{"v":1750,"d":"1,750"},{"v":1720,"d":"1,720"},{"v":12400,"d":"12,400"},{"v":21524.589136362803,"d":"21,525"},{"v":1968,"d":"1,968"},676,{"v":2644,"d":"2,644"},{"v":9959.601562928936,"d":"9,960"},{"v":8395,"d":"8,395"},{"v":1795,"d":"1,795"},617,{"v":2412,"d":"2,412"},{"v":7835,"d":"7,835"},{"v":31760,"d":"31,760"}]
[null,"Scottish Borders2014-15","Scottish Borders","2014-15",650,280,270,120,{"v":1170,"d":"1,170"},{"v":1150,"d":"1,150"},{"v":7300,"d":"7,300"},{"v":14146.979100073764,"d":"14,147"},{"v":2686,"d":"2,686"},549,{"v":3235,"d":"3,235"},{"v":7753.239242685026,"d":"7,753"},{"v":6325,"d":"6,325"},{"v":2403,"d":"2,403"},491,{"v":2894,"d":"2,894"},{"v":5679,"d":"5,679"},{"v":26330,"d":"26,330"}]
[null,"Shetland Islands2014-15","Shetland Islands","2014-15",100,20,20,0,310,220,{"v":2100,"d":"2,100"},{"v":4902.986969140556,"d":"4,903"},177,0,177,{"v":3554.624296629746,"d":"3,555"},{"v":2767,"d":"2,767"},175,0,175,{"v":2734,"d":"2,734"},{"v":4237,"d":"4,237"}]
[null,"South Ayrshire2014-15","South Ayrshire","2014-15",900,380,370,330,{"v":1350,"d":"1,350"},{"v":1340,"d":"1,340"},{"v":12700,"d":"12,700"},{"v":17490.058672202915,"d":"17,490"},{"v":4250,"d":"4,250"},{"v":1525,"d":"1,525"},{"v":5775,"d":"5,775"},{"v":10244.692873583968,"d":"10,245"},{"v":10222,"d":"10,222"},{"v":4093,"d":"4,093"},{"v":1468,"d":"1,468"},{"v":5561,"d":"5,561"},{"v":9718,"d":"9,718"},{"v":26378,"d":"26,378"}]
[null,"South Lanarkshire2014-15","South Lanarkshire","2014-15",{"v":1690,"d":"1,690"},530,530,380,{"v":2790,"d":"2,790"},{"v":2710,"d":"2,710"},{"v":25800,"d":"25,800"},{"v":38112.36726456007,"d":"38,112"},{"v":4689,"d":"4,689"},{"v":1567,"d":"1,567"},{"v":6256,"d":"6,256"},{"v":21294.72373391846,"d":"21,295"},{"v":14054,"d":"14,054"},{"v":4549,"d":"4,549"},{"v":1521,"d":"1,521"},{"v":6070,"d":"6,070"},{"v":13637,"d":"13,637"},{"v":57583,"d":"57,583"}]
[null,"Stirling2014-15","Stirling","2014-15",440,180,180,110,840,810,{"v":7900,"d":"7,900"},{"v":9691.867992546986,"d":"9,692"},{"v":1834,"d":"1,834"},471,{"v":2305,"d":"2,305"},{"v":5855.576798444588,"d":"5,856"},{"v":4975,"d":"4,975"},{"v":1772,"d":"1,772"},455,{"v":2227,"d":"2,227"},{"v":4806,"d":"4,806"},{"v":16894,"d":"16,894"}]
[null,"West Dunbartonshire2014-15","West Dunbartonshire","2014-15",540,90,90,40,{"v":1180,"d":"1,180"},{"v":1110,"d":"1,110"},{"v":8000,"d":"8,000"},{"v":13193.202228998569,"d":"13,193"},820,141,961,{"v":7442.007394014626,"d":"7,442"},{"v":5116,"d":"5,116"},759,130,889,{"v":4732,"d":"4,732"},{"v":15745,"d":"15,745"}]
[null,"West Lothian2014-15","West Lothian","2014-15",680,190,190,140,{"v":1420,"d":"1,420"},{"v":1360,"d":"1,360"},{"v":10700,"d":"10,700"},{"v":14525.296497525953,"d":"14,525"},{"v":1525,"d":"1,525"},626,{"v":2151,"d":"2,151"},{"v":14066.098670806248,"d":"14,066"},{"v":6312,"d":"6,312"},{"v":1455,"d":"1,455"},596,{"v":2051,"d":"2,051"},{"v":6091,"d":"6,091"},{"v":27148,"d":"27,148"}]
[null,"Scotland2014-15","Scotland","2014-15",{"v":30520,"d":"30,520"},9910,9870,{"v":6080,"d":"6,080"},{"v":50160,"d":"50,160"},{"v":46750,"d":"46,750"},{"v":401600,"d":"401,600"},{"v":635650.2098870114,"d":"635,650"},{"v":99548,"d":"99,548"},{"v":26629,"d":"26,629"},{"v":126177,"d":"126,177"},{"v":450089.72943329223,"d":"450,090"},{"v":362496,"d":"362,496"},{"v":87996,"d":"87,996"},{"v":24874,"d":"24,874"},{"v":112870,"d":"112,870"},{"v":330647,"d":"330,647"},{"v":968450,"d":"968,450"}]
[null,"Aberdeen City2015-16","Aberdeen City","2015-16",{"v":1310,"d":"1,310"},410,410,270,{"v":1560,"d":"1,560"},{"v":1560,"d":"1,560"},{"v":12200,"d":"12,200"},{"v":26155.062859801128,"d":"26,155"},{"v":3566,"d":"3,566"},{"v":1106,"d":"1,106"},{"v":4672,"d":"4,672"},{"v":21523.450136651743,"d":"21,523"},{"v":9475,"d":"9,475"},{"v":3518,"d":"3,518"},{"v":1090,"d":"1,090"},{"v":4608,"d":"4,608"},{"v":9349,"d":"9,349"},{"v":34426,"d":"34,426"}]
[null,"Aberdeenshire2015-16","Aberdeenshire","2015-16",{"v":1480,"d":"1,480"},480,480,320,{"v":1870,"d":"1,870"},{"v":1830,"d":"1,830"},{"v":13900,"d":"13,900"},{"v":29002.36930203589,"d":"29,002"},{"v":4546,"d":"4,546"},{"v":1381,"d":"1,381"},{"v":5927,"d":"5,927"},{"v":19873.775520002077,"d":"19,874"},{"v":16941,"d":"16,941"},{"v":4259,"d":"4,259"},{"v":1294,"d":"1,294"},{"v":5553,"d":"5,553"},{"v":16418,"d":"16,418"},{"v":46711,"d":"46,711"}]
[null,"Angus2015-16","Angus","2015-16",710,240,240,90,{"v":1050,"d":"1,050"},670,{"v":3900,"d":"3,900"},{"v":17085.95773482008,"d":"17,086"},{"v":1931,"d":"1,931"},361,{"v":2292,"d":"2,292"},{"v":4700.243024784535,"d":"4,700"},{"v":3527,"d":"3,527"},{"v":1863,"d":"1,863"},348,{"v":2211,"d":"2,211"},{"v":3438,"d":"3,438"},{"v":26077,"d":"26,077"}]
[null,"Argyll & Bute2015-16","Argyll & Bute","2015-16",520,170,170,80,{"v":1020,"d":"1,020"},{"v":1020,"d":"1,020"},{"v":10300,"d":"10,300"},{"v":13433.209561042919,"d":"13,433"},{"v":1668,"d":"1,668"},325,{"v":1993,"d":"1,993"},{"v":13393.973380860667,"d":"13,394"},{"v":10456,"d":"10,456"},{"v":1493,"d":"1,493"},291,{"v":1784,"d":"1,784"},{"v":9186,"d":"9,186"},{"v":21324,"d":"21,324"}]
[null,"Clackmannanshire2015-16","Clackmannanshire","2015-16",220,60,60,60,530,520,{"v":4900,"d":"4,900"},{"v":3912,"d":"3,912"},469,195,664,{"v":2610,"d":"2,610"},{"v":2105,"d":"2,105"},434,181,615,{"v":1949,"d":"1,949"},{"v":9673,"d":"9,673"}]
[null,"Dumfries & Galloway2015-16","Dumfries & Galloway","2015-16",{"v":1050,"d":"1,050"},510,510,410,{"v":1820,"d":"1,820"},{"v":1690,"d":"1,690"},{"v":16300,"d":"16,300"},{"v":10486.090302738356,"d":"10,486"},{"v":3265,"d":"3,265"},{"v":1211,"d":"1,211"},{"v":4476,"d":"4,476"},{"v":18013.075110238264,"d":"18,013"},{"v":19209,"d":"19,209"},{"v":3023,"d":"3,023"},{"v":1121,"d":"1,121"},{"v":4144,"d":"4,144"},{"v":17786,"d":"17,786"},{"v":36341,"d":"36,341"}]
[null,"Dundee City2015-16","Dundee City","2015-16",{"v":1030,"d":"1,030"},340,330,180,{"v":1680,"d":"1,680"},{"v":1230,"d":"1,230"},{"v":9300,"d":"9,300"},{"v":23068.757867428656,"d":"23,069"},{"v":3094,"d":"3,094"},794,{"v":3888,"d":"3,888"},{"v":12636.348685942023,"d":"12,636"},{"v":10756,"d":"10,756"},{"v":2900,"d":"2,900"},744,{"v":3644,"d":"3,644"},{"v":9781,"d":"9,781"},{"v":25858,"d":"25,858"}]
[null,"East Ayrshire2015-16","East Ayrshire","2015-16",740,200,200,130,{"v":1590,"d":"1,590"},{"v":1590,"d":"1,590"},{"v":11900,"d":"11,900"},{"v":13623.216706443915,"d":"13,623"},{"v":1942,"d":"1,942"},575,{"v":2517,"d":"2,517"},{"v":11059.735465393795,"d":"11,060"},{"v":10921,"d":"10,921"},{"v":1798,"d":"1,798"},533,{"v":2331,"d":"2,331"},{"v":8570,"d":"8,570"},{"v":23511,"d":"23,511"}]
[null,"East Dunbartonshire2015-16","East Dunbartonshire","2015-16",650,360,360,330,{"v":1070,"d":"1,070"},{"v":1050,"d":"1,050"},{"v":9300,"d":"9,300"},{"v":9355.292179402419,"d":"9,355"},{"v":3634,"d":"3,634"},{"v":1460,"d":"1,460"},{"v":5094,"d":"5,094"},{"v":10854.881699332465,"d":"10,855"},{"v":6096,"d":"6,096"},{"v":3461,"d":"3,461"},{"v":1391,"d":"1,391"},{"v":4852,"d":"4,852"},{"v":5655,"d":"5,655"},{"v":23012,"d":"23,012"}]
[null,"East Lothian2015-16","East Lothian","2015-16",590,230,230,160,{"v":1060,"d":"1,060"},{"v":1030,"d":"1,030"},{"v":9200,"d":"9,200"},{"v":13326.243961352657,"d":"13,326"},{"v":2100,"d":"2,100"},688,{"v":2788,"d":"2,788"},{"v":8583.14458247067,"d":"8,583"},{"v":6467,"d":"6,467"},{"v":2021,"d":"2,021"},659,{"v":2680,"d":"2,680"},{"v":6228,"d":"6,228"},{"v":19935,"d":"19,935"}]
[null,"East Renfrewshire2015-16","East Renfrewshire","2015-16",580,250,250,150,770,750,{"v":5300,"d":"5,300"},{"v":10296.816319510797,"d":"10,297"},{"v":3324,"d":"3,324"},778,{"v":4102,"d":"4,102"},{"v":6456.473877317027,"d":"6,456"},{"v":5053,"d":"5,053"},{"v":3191,"d":"3,191"},747,{"v":3938,"d":"3,938"},{"v":4917,"d":"4,917"},{"v":18037,"d":"18,037"}]
[null,"Edinburgh, City of2015-16","Edinburgh, City of","2015-16",{"v":2600,"d":"2,600"},1270,1260,660,{"v":3430,"d":"3,430"},{"v":3400,"d":"3,400"},{"v":39900,"d":"39,900"},{"v":53263.55003925239,"d":"53,264"},{"v":9740,"d":"9,740"},{"v":3228,"d":"3,228"},{"v":12968,"d":"12,968"},{"v":50144.25537455841,"d":"50,144"},{"v":38694,"d":"38,694"},{"v":8961,"d":"8,961"},{"v":2971,"d":"2,971"},{"v":11932,"d":"11,932"},{"v":35598,"d":"35,598"},{"v":74828,"d":"74,828"}]
[null,"Eilean Siar2015-16","Eilean Siar","2015-16",190,30,30,20,390,390,{"v":3100,"d":"3,100"},{"v":6740.943391729234,"d":"6,741"},265,75,340,{"v":5257.251638660469,"d":"5,257"},{"v":4068,"d":"4,068"},231,65,296,{"v":3950,"d":"3,950"},{"v":6561,"d":"6,561"}]
[null,"Falkirk2015-16","Falkirk","2015-16",890,180,180,150,{"v":1860,"d":"1,860"},{"v":1710,"d":"1,710"},{"v":11700,"d":"11,700"},{"v":16326.55130723893,"d":"16,327"},{"v":2147,"d":"2,147"},785,{"v":2932,"d":"2,932"},{"v":9121.724195254646,"d":"9,122"},{"v":7014,"d":"7,014"},{"v":1987,"d":"1,987"},778,{"v":2765,"d":"2,765"},{"v":6621,"d":"6,621"},{"v":28548,"d":"28,548"}]
[null,"Fife2015-16","Fife","2015-16",{"v":2310,"d":"2,310"},810,810,400,{"v":2610,"d":"2,610"},{"v":2400,"d":"2,400"},{"v":20300,"d":"20,300"},{"v":45031.28329005935,"d":"45,031"},{"v":8142,"d":"8,142"},{"v":1968,"d":"1,968"},{"v":10110,"d":"10,110"},{"v":17854.195382047477,"d":"17,854"},{"v":17589,"d":"17,589"},{"v":7622,"d":"7,622"},{"v":1843,"d":"1,843"},{"v":9465,"d":"9,465"},{"v":16467,"d":"16,467"},{"v":72362,"d":"72,362"}]
[null,"Glasgow City2015-16","Glasgow City","2015-16",{"v":3600,"d":"3,600"},660,660,350,{"v":5460,"d":"5,460"},{"v":5180,"d":"5,180"},{"v":45400,"d":"45,400"},{"v":72067.64058635793,"d":"72,068"},{"v":12779,"d":"12,779"},{"v":1517,"d":"1,517"},{"v":14296,"d":"14,296"},{"v":52933.566213957085,"d":"52,934"},{"v":48450,"d":"48,450"},{"v":5644,"d":"5,644"},{"v":1235,"d":"1,235"},{"v":6879,"d":"6,879"},{"v":43576,"d":"43,576"},{"v":83503,"d":"83,503"}]
[null,"Highland2015-16","Highland","2015-16",{"v":1570,"d":"1,570"},440,430,150,{"v":1660,"d":"1,660"},{"v":1640,"d":"1,640"},{"v":12100,"d":"12,100"},{"v":36095.20441812496,"d":"36,095"},{"v":3955,"d":"3,955"},603,{"v":4558,"d":"4,558"},{"v":21154.902455253177,"d":"21,155"},{"v":18581,"d":"18,581"},{"v":3859,"d":"3,859"},588,{"v":4447,"d":"4,447"},{"v":18128,"d":"18,128"},{"v":49077,"d":"49,077"}]
[null,"Inverclyde2015-16","Inverclyde","2015-16",620,130,130,120,{"v":1160,"d":"1,160"},{"v":1130,"d":"1,130"},{"v":9000,"d":"9,000"},{"v":12158.36863786159,"d":"12,158"},{"v":1497,"d":"1,497"},609,{"v":2106,"d":"2,106"},{"v":8256.30342975711,"d":"8,256"},{"v":7192,"d":"7,192"},{"v":1362,"d":"1,362"},554,{"v":1916,"d":"1,916"},{"v":6545,"d":"6,545"},{"v":15891,"d":"15,891"}]
[null,"Midlothian2015-16","Midlothian","2015-16",380,110,110,90,770,770,{"v":6400,"d":"6,400"},{"v":8423.473477557935,"d":"8,423"},875,330,{"v":1205,"d":"1,205"},{"v":8166.314612364308,"d":"8,166"},{"v":7704,"d":"7,704"},830,313,{"v":1143,"d":"1,143"},{"v":7307,"d":"7,307"},{"v":15995,"d":"15,995"}]
[null,"Moray2015-16","Moray","2015-16",470,170,170,40,950,880,{"v":8200,"d":"8,200"},{"v":8104.838457802518,"d":"8,105"},{"v":1945,"d":"1,945"},242,{"v":2187,"d":"2,187"},{"v":10393.443381776067,"d":"10,393"},{"v":9452,"d":"9,452"},{"v":1738,"d":"1,738"},217,{"v":1955,"d":"1,955"},{"v":7151,"d":"7,151"},{"v":19389,"d":"19,389"}]
[null,"North Ayrshire2015-16","North Ayrshire","2015-16",880,300,300,180,{"v":1630,"d":"1,630"},{"v":1620,"d":"1,620"},{"v":13600,"d":"13,600"},{"v":16675.524343161705,"d":"16,676"},{"v":3245,"d":"3,245"},964,{"v":4209,"d":"4,209"},{"v":14341.728791554204,"d":"14,342"},{"v":13013,"d":"13,013"},{"v":3107,"d":"3,107"},923,{"v":4030,"d":"4,030"},{"v":12396,"d":"12,396"},{"v":28813,"d":"28,813"}]
[null,"North Lanarkshire2015-16","North Lanarkshire","2015-16",{"v":1290,"d":"1,290"},250,250,230,{"v":3160,"d":"3,160"},{"v":3120,"d":"3,120"},{"v":27700,"d":"27,700"},{"v":29303.867966249636,"d":"29,304"},{"v":2327,"d":"2,327"},995,{"v":3322,"d":"3,322"},{"v":31242.04798370672,"d":"31,242"},{"v":28047,"d":"28,047"},{"v":2155,"d":"2,155"},921,{"v":3076,"d":"3,076"},{"v":22157,"d":"22,157"},{"v":55784,"d":"55,784"}]
[null,{"$f":"C290&D290","v":"Orkney Islands2015-16"},"Orkney Islands","2015-16",100,20,20,0,170,170,900,{"v":4268,"d":"4,268"},221,9,230,{"v":2199,"d":"2,199"},{"v":1544,"d":"1,544"},205,8,213,{"v":1430,"d":"1,430"},{"v":4814,"d":"4,814"}]
[null,"Perth & Kinross2015-16","Perth & Kinross","2015-16",960,390,390,160,{"v":1290,"d":"1,290"},{"v":1120,"d":"1,120"},{"v":10300,"d":"10,300"},{"v":16446.9392339713,"d":"16,447"},{"v":3390,"d":"3,390"},647,{"v":4037,"d":"4,037"},{"v":9525.793307132391,"d":"9,526"},{"v":8892,"d":"8,892"},{"v":3223,"d":"3,223"},615,{"v":3838,"d":"3,838"},{"v":8454,"d":"8,454"},{"v":33256,"d":"33,256"}]
[null,"Renfrewshire2015-16","Renfrewshire","2015-16",{"v":1010,"d":"1,010"},260,260,200,{"v":1750,"d":"1,750"},{"v":1650,"d":"1,650"},{"v":12700,"d":"12,700"},{"v":21870.17036213248,"d":"21,870"},{"v":2379,"d":"2,379"},843,{"v":3222,"d":"3,222"},{"v":10860.869395982485,"d":"10,861"},{"v":10138,"d":"10,138"},{"v":2170,"d":"2,170"},769,{"v":2939,"d":"2,939"},{"v":9462,"d":"9,462"},{"v":32118,"d":"32,118"}]
[null,"Scottish Borders2015-16","Scottish Borders","2015-16",670,190,190,90,{"v":1170,"d":"1,170"},{"v":1160,"d":"1,160"},{"v":7000,"d":"7,000"},{"v":14020.924332977587,"d":"14,021"},{"v":1848,"d":"1,848"},390,{"v":2238,"d":"2,238"},{"v":8053.836819637139,"d":"8,054"},{"v":6601,"d":"6,601"},{"v":1653,"d":"1,653"},349,{"v":2002,"d":"2,002"},{"v":5927,"d":"5,927"},{"v":26748,"d":"26,748"}]
[null,"Shetland Islands2015-16","Shetland Islands","2015-16",80,20,20,0,290,200,{"v":2200,"d":"2,200"},{"v":4630.409493359567,"d":"4,630"},173,0,173,{"v":3803.633976881456,"d":"3,804"},{"v":2887,"d":"2,887"},171,0,171,{"v":2853,"d":"2,853"},{"v":4327,"d":"4,327"}]
[null,"South Ayrshire2015-16","South Ayrshire","2015-16",850,390,390,320,{"v":1290,"d":"1,290"},{"v":1280,"d":"1,280"},{"v":14400,"d":"14,400"},{"v":17693.949260042282,"d":"17,694"},{"v":5119,"d":"5,119"},{"v":1572,"d":"1,572"},{"v":6691,"d":"6,691"},{"v":9866.603329809725,"d":"9,867"},{"v":9876,"d":"9,876"},{"v":4967,"d":"4,967"},{"v":1515,"d":"1,515"},{"v":6482,"d":"6,482"},{"v":9433,"d":"9,433"},{"v":26783,"d":"26,783"}]
[null,"South Lanarkshire2015-16","South Lanarkshire","2015-16",{"v":1800,"d":"1,800"},550,540,410,{"v":2750,"d":"2,750"},{"v":2690,"d":"2,690"},{"v":26600,"d":"26,600"},{"v":39715.08768831268,"d":"39,715"},{"v":5037,"d":"5,037"},{"v":1729,"d":"1,729"},{"v":6766,"d":"6,766"},{"v":21253.477345196952,"d":"21,253"},{"v":13949,"d":"13,949"},{"v":4925,"d":"4,925"},{"v":1690,"d":"1,690"},{"v":6615,"d":"6,615"},{"v":13618,"d":"13,618"},{"v":58390,"d":"58,390"}]
[null,"Stirling2015-16","Stirling","2015-16",440,180,170,120,810,780,{"v":7800,"d":"7,800"},{"v":9721.27169138974,"d":"9,721"},{"v":1928,"d":"1,928"},563,{"v":2491,"d":"2,491"},{"v":4832.5462003812045,"d":"4,833"},{"v":4302,"d":"4,302"},{"v":1847,"d":"1,847"},540,{"v":2387,"d":"2,387"},{"v":4083,"d":"4,083"},{"v":17143,"d":"17,143"}]
[null,"West Dunbartonshire2015-16","West Dunbartonshire","2015-16",540,90,90,50,{"v":1240,"d":"1,240"},{"v":1180,"d":"1,180"},{"v":7500,"d":"7,500"},{"v":13537.888306451612,"d":"13,538"},934,187,{"v":1121,"d":"1,121"},{"v":7303.9573924731185,"d":"7,304"},{"v":5024,"d":"5,024"},864,173,{"v":1037,"d":"1,037"},{"v":4647,"d":"4,647"},{"v":15894,"d":"15,894"}]
[null,"West Lothian2015-16","West Lothian","2015-16",700,200,200,150,{"v":1570,"d":"1,570"},{"v":1510,"d":"1,510"},{"v":11800,"d":"11,800"},{"v":15129.380513156662,"d":"15,129"},{"v":1650,"d":"1,650"},683,{"v":2333,"d":"2,333"},{"v":16110.227502575148,"d":"16,110"},{"v":7182,"d":"7,182"},{"v":1574,"d":"1,574"},651,{"v":2225,"d":"2,225"},{"v":6931,"d":"6,931"},{"v":27869,"d":"27,869"}]
[null,"Scotland2015-16","Scotland","2015-16",{"v":30800,"d":"30,800"},9870,9820,{"v":6040,"d":"6,040"},{"v":49430,"d":"49,430"},{"v":46910,"d":"46,910"},{"v":405400,"d":"405,400"},{"v":631590.8620986618,"d":"631,591"},{"v":99135,"d":"99,135"},{"v":26813,"d":"26,813"},{"v":125948,"d":"125,948"},{"v":452380.78021195246,"d":"452,381"},{"v":371205,"d":"371,205"},{"v":87056,"d":"87,056"},{"v":25117,"d":"25,117"},{"v":112173,"d":"112,173"},{"v":340011,"d":"340,011"},{"v":982998,"d":"982,998"}]
[null,"Aberdeen City2016-17","Aberdeen City","2016-17",{"v":1260,"d":"1,260"},420,410,290,{"v":1500,"d":"1,500"},{"v":1500,"d":"1,500"},{"v":13500,"d":"13,500"},{"v":26622.10487897498,"d":"26,622"},{"v":3523,"d":"3,523"},{"v":1107,"d":"1,107"},{"v":4630,"d":"4,630"},{"v":21326.906527334355,"d":"21,327"},{"v":9785,"d":"9,785"},{"v":3479,"d":"3,479"},{"v":1091,"d":"1,091"},{"v":4570,"d":"4,570"},{"v":9735,"d":"9,735"},{"v":34832,"d":"34,832"}]
[null,"Aberdeenshire2016-17","Aberdeenshire","2016-17",{"v":1450,"d":"1,450"},500,500,360,{"v":1980,"d":"1,980"},{"v":1960,"d":"1,960"},{"v":15600,"d":"15,600"},{"v":29599.434160537723,"d":"29,599"},{"v":4916,"d":"4,916"},{"v":1669,"d":"1,669"},{"v":6585,"d":"6,585"},{"v":19385.323681262482,"d":"19,385"},{"v":17084,"d":"17,084"},{"v":4605,"d":"4,605"},{"v":1564,"d":"1,564"},{"v":6169,"d":"6,169"},{"v":16557,"d":"16,557"},{"v":47771,"d":"47,771"}]
[null,"Angus2016-17","Angus","2016-17",750,280,280,100,{"v":1300,"d":"1,300"},730,{"v":4900,"d":"4,900"},{"v":20129.032470033762,"d":"20,129"},{"v":2654,"d":"2,654"},257,{"v":2911,"d":"2,911"},{"v":5796.236489701584,"d":"5,796"},{"v":2906,"d":"2,906"},{"v":2559,"d":"2,559"},248,{"v":2807,"d":"2,807"},{"v":2833,"d":"2,833"},{"v":26487,"d":"26,487"}]
[null,"Argyll & Bute2016-17","Argyll & Bute","2016-17",550,180,180,90,{"v":1020,"d":"1,020"},{"v":1010,"d":"1,010"},{"v":9600,"d":"9,600"},{"v":14943.355649231793,"d":"14,943"},{"v":1711,"d":"1,711"},354,{"v":2065,"d":"2,065"},{"v":13670.529369349382,"d":"13,671"},{"v":13585,"d":"13,585"},{"v":1613,"d":"1,613"},331,{"v":1944,"d":"1,944"},{"v":11935,"d":"11,935"},{"v":21556,"d":"21,556"}]
[null,"Clackmannanshire2016-17","Clackmannanshire","2016-17",230,50,50,50,510,500,{"v":4900,"d":"4,900"},{"v":4333.293703321392,"d":"4,333"},523,239,762,{"v":3019.8803813224845,"d":"3,020"},{"v":2758,"d":"2,758"},484,221,705,{"v":2554,"d":"2,554"},{"v":9883,"d":"9,883"}]
[null,"Dumfries & Galloway2016-17","Dumfries & Galloway","2016-17",{"v":1110,"d":"1,110"},210,210,40,{"v":1750,"d":"1,750"},{"v":1600,"d":"1,600"},{"v":20600,"d":"20,600"},{"v":11683.384127758138,"d":"11,683"},{"v":2022,"d":"2,022"},153,{"v":2175,"d":"2,175"},{"v":18746.0712457115,"d":"18,746"},{"v":17311,"d":"17,311"},{"v":1872,"d":"1,872"},142,{"v":2014,"d":"2,014"},{"v":16029,"d":"16,029"},{"v":36907,"d":"36,907"}]
[null,"Dundee City2016-17","Dundee City","2016-17",{"v":1030,"d":"1,030"},330,330,180,{"v":1730,"d":"1,730"},{"v":1250,"d":"1,250"},{"v":9800,"d":"9,800"},{"v":23453.61529933481,"d":"23,454"},{"v":3036,"d":"3,036"},766,{"v":3802,"d":"3,802"},{"v":11921.29711751663,"d":"11,921"},{"v":9811,"d":"9,811"},{"v":2855,"d":"2,855"},720,{"v":3575,"d":"3,575"},{"v":8922,"d":"8,922"},{"v":25967,"d":"25,967"}]
[null,"East Ayrshire2016-17","East Ayrshire","2016-17",730,200,200,130,{"v":1500,"d":"1,500"},{"v":1500,"d":"1,500"},{"v":11200,"d":"11,200"},{"v":12902.30827394181,"d":"12,902"},{"v":2048,"d":"2,048"},594,{"v":2642,"d":"2,642"},{"v":10895.171226403045,"d":"10,895"},{"v":10422,"d":"10,422"},{"v":1896,"d":"1,896"},550,{"v":2446,"d":"2,446"},{"v":8178,"d":"8,178"},{"v":23917,"d":"23,917"}]
[null,"East Dunbartonshire2016-17","East Dunbartonshire","2016-17",680,380,380,330,{"v":1090,"d":"1,090"},{"v":1070,"d":"1,070"},{"v":9800,"d":"9,800"},{"v":8368.011402644697,"d":"8,368"},{"v":3600,"d":"3,600"},{"v":1437,"d":"1,437"},{"v":5037,"d":"5,037"},{"v":11236.021491895764,"d":"11,236"},{"v":6778,"d":"6,778"},{"v":3428,"d":"3,428"},{"v":1369,"d":"1,369"},{"v":4797,"d":"4,797"},{"v":6567,"d":"6,567"},{"v":23405,"d":"23,405"}]
[null,"East Lothian2016-17","East Lothian","2016-17",580,210,210,140,{"v":1050,"d":"1,050"},{"v":1030,"d":"1,030"},{"v":9200,"d":"9,200"},{"v":13911.244646464647,"d":"13,911"},{"v":1911,"d":"1,911"},647,{"v":2558,"d":"2,558"},{"v":8673.276767676767,"d":"8,673"},{"v":5735,"d":"5,735"},{"v":1816,"d":"1,816"},615,{"v":2431,"d":"2,431"},{"v":5451,"d":"5,451"},{"v":20398,"d":"20,398"}]
[null,"East Renfrewshire2016-17","East Renfrewshire","2016-17",590,320,320,140,990,970,{"v":6600,"d":"6,600"},{"v":7626.70897098603,"d":"7,627"},{"v":2172,"d":"2,172"},504,{"v":2676,"d":"2,676"},{"v":8296.036721384371,"d":"8,296"},{"v":5997,"d":"5,997"},{"v":2085,"d":"2,085"},484,{"v":2569,"d":"2,569"},{"v":5757,"d":"5,757"},{"v":18353,"d":"18,353"}]
[null,"Edinburgh, City of2016-17","Edinburgh, City of","2016-17",{"v":2530,"d":"2,530"},1250,1240,620,{"v":3210,"d":"3,210"},{"v":3160,"d":"3,160"},{"v":36800,"d":"36,800"},{"v":52237.187017883596,"d":"52,237"},{"v":10482,"d":"10,482"},{"v":2454,"d":"2,454"},{"v":12936,"d":"12,936"},{"v":40180.51085904086,"d":"40,181"},{"v":48010,"d":"48,010"},{"v":9644,"d":"9,644"},{"v":2257,"d":"2,257"},{"v":11901,"d":"11,901"},{"v":44169,"d":"44,169"},{"v":75933,"d":"75,933"}]
[null,"Eilean Siar2016-17","Eilean Siar","2016-17",190,50,50,20,360,360,{"v":2300,"d":"2,300"},{"v":7044.328323511921,"d":"7,044"},481,79,560,{"v":5046.253879007407,"d":"5,046"},{"v":3089,"d":"3,089"},418,69,487,{"v":2376,"d":"2,376"},{"v":6639,"d":"6,639"}]
[null,"Falkirk2016-17","Falkirk","2016-17",860,210,210,180,{"v":1810,"d":"1,810"},{"v":1670,"d":"1,670"},{"v":11600,"d":"11,600"},{"v":16766.431002233643,"d":"16,766"},{"v":1736,"d":"1,736"},665,{"v":2401,"d":"2,401"},{"v":9657.714075580656,"d":"9,658"},{"v":8400,"d":"8,400"},{"v":1647,"d":"1,647"},631,{"v":2278,"d":"2,278"},{"v":7954,"d":"7,954"},{"v":29157,"d":"29,157"}]
[null,"Fife2016-17","Fife","2016-17",{"v":2290,"d":"2,290"},850,850,500,{"v":2590,"d":"2,590"},{"v":1650,"d":"1,650"},{"v":20900,"d":"20,900"},{"v":47142.44166245514,"d":"47,142"},{"v":8531,"d":"8,531"},{"v":2082,"d":"2,082"},{"v":10613,"d":"10,613"},{"v":14709.97170708308,"d":"14,710"},{"v":11216,"d":"11,216"},{"v":7945,"d":"7,945"},{"v":1937,"d":"1,937"},{"v":9882,"d":"9,882"},{"v":10446,"d":"10,446"},{"v":73658,"d":"73,658"}]
[null,"Glasgow City2016-17","Glasgow City","2016-17",{"v":3330,"d":"3,330"},700,690,340,{"v":5400,"d":"5,400"},{"v":5140,"d":"5,140"},{"v":45600,"d":"45,600"},{"v":65965.79973012971,"d":"65,966"},{"v":12333,"d":"12,333"},{"v":1516,"d":"1,516"},{"v":13849,"d":"13,849"},{"v":57291.67750935841,"d":"57,292"},{"v":47138,"d":"47,138"},{"v":5350,"d":"5,350"},{"v":1234,"d":"1,234"},{"v":6584,"d":"6,584"},{"v":42396,"d":"42,396"},{"v":83790,"d":"83,790"}]
[null,"Highland2016-17","Highland","2016-17",{"v":1580,"d":"1,580"},450,440,180,{"v":1600,"d":"1,600"},{"v":1590,"d":"1,590"},{"v":12000,"d":"12,000"},{"v":38583.290484716716,"d":"38,583"},{"v":4029,"d":"4,029"},727,{"v":4756,"d":"4,756"},{"v":23500.182785522444,"d":"23,500"},{"v":19316,"d":"19,316"},{"v":3731,"d":"3,731"},673,{"v":4404,"d":"4,404"},{"v":18845,"d":"18,845"},{"v":50076,"d":"50,076"}]
[null,"Inverclyde2016-17","Inverclyde","2016-17",600,140,140,120,{"v":1150,"d":"1,150"},{"v":1140,"d":"1,140"},{"v":8200,"d":"8,200"},{"v":12387.750253077753,"d":"12,388"},{"v":1575,"d":"1,575"},654,{"v":2229,"d":"2,229"},{"v":8293.352676093133,"d":"8,293"},{"v":7162,"d":"7,162"},{"v":1432,"d":"1,432"},595,{"v":2027,"d":"2,027"},{"v":6518,"d":"6,518"},{"v":16169,"d":"16,169"}]
[null,"Midlothian2016-17","Midlothian","2016-17",410,110,110,100,830,830,{"v":7200,"d":"7,200"},{"v":8562.416091871006,"d":"8,562"},{"v":1057,"d":"1,057"},413,{"v":1470,"d":"1,470"},{"v":7964.709147376404,"d":"7,965"},{"v":7321,"d":"7,321"},{"v":1023,"d":"1,023"},400,{"v":1423,"d":"1,423"},{"v":6804,"d":"6,804"},{"v":16392,"d":"16,392"}]
[null,"Moray2016-17","Moray","2016-17",450,160,160,50,820,780,{"v":6400,"d":"6,400"},{"v":7234.475143999706,"d":"7,234"},{"v":2026,"d":"2,026"},286,{"v":2312,"d":"2,312"},{"v":10809.212789375206,"d":"10,809"},{"v":10338,"d":"10,338"},{"v":1764,"d":"1,764"},249,{"v":2013,"d":"2,013"},{"v":7821,"d":"7,821"},{"v":19754,"d":"19,754"}]
[null,"North Ayrshire2016-17","North Ayrshire","2016-17",920,330,330,210,{"v":1620,"d":"1,620"},{"v":1590,"d":"1,590"},{"v":11300,"d":"11,300"},{"v":17392.18309377696,"d":"17,392"},{"v":3487,"d":"3,487"},921,{"v":4408,"d":"4,408"},{"v":14347.902527957287,"d":"14,348"},{"v":13577,"d":"13,577"},{"v":3335,"d":"3,335"},881,{"v":4216,"d":"4,216"},{"v":12933,"d":"12,933"},{"v":29227,"d":"29,227"}]
[null,"North Lanarkshire2016-17","North Lanarkshire","2016-17",{"v":1280,"d":"1,280"},250,250,230,{"v":3160,"d":"3,160"},{"v":3120,"d":"3,120"},{"v":27500,"d":"27,500"},{"v":32254.60511991658,"d":"32,255"},{"v":2360,"d":"2,360"},{"v":1012,"d":"1,012"},{"v":3372,"d":"3,372"},{"v":32573.746110531803,"d":"32,574"},{"v":29302,"d":"29,302"},{"v":2186,"d":"2,186"},937,{"v":3123,"d":"3,123"},{"v":23149,"d":"23,149"},{"v":56497,"d":"56,497"}]
[null,"Orkney Islands2016-17","Orkney Islands","2016-17",90,20,20,0,200,180,{"v":1100,"d":"1,100"},{"v":4177,"d":"4,177"},250,0,250,{"v":2342,"d":"2,342"},{"v":1513,"d":"1,513"},230,0,230,{"v":1401,"d":"1,401"},{"v":4967,"d":"4,967"}]
[null,"Perth & Kinross2016-17","Perth & Kinross","2016-17",{"v":1000,"d":"1,000"},420,420,180,{"v":1390,"d":"1,390"},{"v":1200,"d":"1,200"},{"v":11500,"d":"11,500"},{"v":16058.294064560916,"d":"16,058"},{"v":3975,"d":"3,975"},796,{"v":4771,"d":"4,771"},{"v":8895.252366076595,"d":"8,895"},{"v":8674,"d":"8,674"},{"v":3628,"d":"3,628"},726,{"v":4354,"d":"4,354"},{"v":8247,"d":"8,247"},{"v":33916,"d":"33,916"}]
[null,"Renfrewshire2016-17","Renfrewshire","2016-17",990,260,260,220,{"v":1610,"d":"1,610"},{"v":1590,"d":"1,590"},{"v":11600,"d":"11,600"},{"v":18519,"d":"18,519"},{"v":2445,"d":"2,445"},910,{"v":3355,"d":"3,355"},{"v":14052,"d":"14,052"},{"v":10743,"d":"10,743"},{"v":2231,"d":"2,231"},830,{"v":3061,"d":"3,061"},{"v":10027,"d":"10,027"},{"v":32665,"d":"32,665"}]
[null,"Scottish Borders2016-17","Scottish Borders","2016-17",680,180,180,70,{"v":1100,"d":"1,100"},{"v":1090,"d":"1,090"},{"v":6900,"d":"6,900"},{"v":14289.953852851546,"d":"14,290"},{"v":1776,"d":"1,776"},303,{"v":2079,"d":"2,079"},{"v":8307.165433173705,"d":"8,307"},{"v":7041,"d":"7,041"},{"v":1592,"d":"1,592"},272,{"v":1864,"d":"1,864"},{"v":6322,"d":"6,322"},{"v":27243,"d":"27,243"}]
[null,"Shetland Islands2016-17","Shetland Islands","2016-17",70,20,20,0,270,200,{"v":2100,"d":"2,100"},{"v":4977.308137593232,"d":"4,977"},176,0,176,{"v":3598.764221306913,"d":"3,599"},{"v":2738,"d":"2,738"},174,0,174,{"v":2723,"d":"2,723"},{"v":4403,"d":"4,403"}]
[null,"South Ayrshire2016-17","South Ayrshire","2016-17",910,420,420,310,{"v":1330,"d":"1,330"},{"v":1330,"d":"1,330"},{"v":13100,"d":"13,100"},{"v":15297.596333572968,"d":"15,298"},{"v":3492,"d":"3,492"},{"v":1126,"d":"1,126"},{"v":4618,"d":"4,618"},{"v":12123.067487419123,"d":"12,123"},{"v":10023,"d":"10,023"},{"v":3395,"d":"3,395"},{"v":1095,"d":"1,095"},{"v":4490,"d":"4,490"},{"v":9573,"d":"9,573"},{"v":27257,"d":"27,257"}]
[null,"South Lanarkshire2016-17","South Lanarkshire","2016-17",{"v":1780,"d":"1,780"},550,550,420,{"v":2590,"d":"2,590"},{"v":2840,"d":"2,840"},{"v":28900,"d":"28,900"},{"v":40079.68177978535,"d":"40,080"},{"v":4911,"d":"4,911"},{"v":1710,"d":"1,710"},{"v":6621,"d":"6,621"},{"v":24500.092003592294,"d":"24,500"},{"v":13503,"d":"13,503"},{"v":4773,"d":"4,773"},{"v":1662,"d":"1,662"},{"v":6435,"d":"6,435"},{"v":13183,"d":"13,183"},{"v":59375,"d":"59,375"}]
[null,"Stirling2016-17","Stirling","2016-17",480,180,180,130,830,790,{"v":7900,"d":"7,900"},{"v":11352.862612524077,"d":"11,353"},{"v":2224,"d":"2,224"},670,{"v":2894,"d":"2,894"},{"v":4424.547034081528,"d":"4,425"},{"v":4024,"d":"4,024"},{"v":2090,"d":"2,090"},639,{"v":2729,"d":"2,729"},{"v":3764,"d":"3,764"},{"v":17425,"d":"17,425"}]
[null,"West Dunbartonshire2016-17","West Dunbartonshire","2016-17",550,100,100,60,{"v":1320,"d":"1,320"},{"v":1270,"d":"1,270"},{"v":7100,"d":"7,100"},{"v":13937.389886327419,"d":"13,937"},{"v":1125,"d":"1,125"},260,{"v":1385,"d":"1,385"},{"v":8071.219908636991,"d":"8,071"},{"v":5652,"d":"5,652"},{"v":1041,"d":"1,041"},240,{"v":1281,"d":"1,281"},{"v":5133,"d":"5,133"},{"v":16191,"d":"16,191"}]
[null,"West Lothian2016-17","West Lothian","2016-17",730,190,190,150,{"v":1200,"d":"1,200"},{"v":1150,"d":"1,150"},{"v":9400,"d":"9,400"},{"v":16372.38003248141,"d":"16,372"},{"v":1650,"d":"1,650"},655,{"v":2305,"d":"2,305"},{"v":14135.441341140267,"d":"14,135"},{"v":8161,"d":"8,161"},{"v":1587,"d":"1,587"},630,{"v":2217,"d":"2,217"},{"v":7847,"d":"7,847"},{"v":28642,"d":"28,642"}]
[null,"Scotland2016-17","Scotland","2016-17",{"v":30670,"d":"30,670"},9910,9870,{"v":5940,"d":"5,940"},{"v":48810,"d":"48,810"},{"v":45780,"d":"45,780"},{"v":405000,"d":"405,000"},{"v":634893.0847884293,"d":"634,893"},{"v":98237,"d":"98,237"},{"v":24966,"d":"24,966"},{"v":123203,"d":"123,203"},{"v":457791.5348819124,"d":"457,792"},{"v":379113,"d":"379,113"},{"v":85908,"d":"85,908"},{"v":23292,"d":"23,292"},{"v":109200,"d":"109,200"},{"v":346149,"d":"346,149"},{"v":998852,"d":"998,852"}]

{"sheet":"Lookups","index":1,"n_rows":35,"n_cols":11,"rows_kept":35,"hidden":true}
[]
["Year",null,"Local Authority",null,null,"Clients",null,"Long-stay residents aged 65+ supported in Care Homes",4,11,11]
["2005-06",null,"Scotland",null,null,"Expenditure (£thousands - including overheads)",null,"Self-funders receiving FPNC or FPC only or FNC only in Care Homes",5,14,19]
["2006-07",null,"Aberdeen City",null,null,"Expenditure (£thousands - excluding overheads)",null,"Self-funders 65+ receiving FPC in Care Homes",6,12,17]
["2007-08",null,"Aberdeenshire",{"$nulls":4},"Self-funders receiving FNC in Care Homes",7,13,18]
["2008-09",null,"Angus"]
["2009-10",null,"Argyll & Bute"]
["2010-11",null,"Clackmannanshire",{"$nulls":4},"Home Care Clients aged 65+",8,15,15]
["2011-12",null,"Dumfries & Galloway",{"$nulls":4},"Clients aged 65+ receiving FPC at home",9,16,20]
["2012-13",null,"Dundee City",{"$nulls":4},"Average weekly hours of FPC at home",10]
["2013-14",null,"East Ayrshire"]
["2014-15",null,"East Dunbartonshire"]
["2015-16",null,"East Lothian"]
[null,null,"East Renfrewshire"]
[null,null,"Edinburgh, City of"]
[null,null,"Eilean Siar"]
[null,null,"Falkirk"]
[null,null,"Fife"]
[null,null,"Glasgow City"]
[null,null,"Highland"]
[null,null,"Inverclyde"]
[null,null,"Midlothian"]
[null,null,"Moray"]
[null,null,"North Ayrshire"]
[null,null,"North Lanarkshire"]
[null,null,"Orkney Islands"]
[null,null,"Perth & Kinross"]
[null,null,"Renfrewshire"]
[null,null,"Scottish Borders"]
[null,null,"Shetland Islands"]
[null,null,"South Ayrshire"]
[null,null,"South Lanarkshire"]
[null,null,"Stirling"]
[null,null,"West Dunbartonshire"]
[null,null,"West Lothian"]

{"sheet":"Main","index":2,"n_rows":22,"n_cols":10,"rows_kept":22,"merged":[[2,1,2,9],[3,1,3,6],[8,2,8,8],[10,2,10,8],[12,2,12,8],[14,2,14,8],[16,2,16,8],[19,1,19,9],[21,1,21,9]]}
[null,"Free Personal & Nursing Care 2007-08 to 2016-17"]
[]
[null,"This spreadsheet presents the latest figures for free personal care (FPC) and free nursing care (FNC). Free personal and nursing care (FPNC) was introduced in Scotland on 1 July 2002.  Prior to 1 July 2002, people could be charged for personal care services provided in their own home and many residents in Care Homes had to fully fund their care from their own income and savings.  \n\nCare at home: \nb people aged 65 and over can no longer be charged for personal care services provided in their own home.  They can however be charged for domestic services such as help with shopping or housework but any charge would be subject to a financial assessment.  \n\nCare Homes:\nb people aged 65 or over who live in care homes and are assessed as self-funders can receive a weekly payment towards their personal care. This weekly FPC payment was set at £145 from 1 July 2002 and has risen to £171 from 1 April 2015. \nb people of all ages who live in care homes and are assessed as self-funders can receive a further payment if they require nursing care. This weekly FNC payment was set at £65 from 1 July 2002 and has risen to £78 from 1 April 2015.\nb the remainder of the care homes fees are funded themselves. "]
[null,"Please refer to the background notes for further information on the data collection",{"$nulls":5},"Background notes"]
[]
[null,"Contents",{"$nulls":7},"Links"]
[]
[null,"Table 1 -","FPNC provided to clients in a Care Home or provide at home, 2007-08 to 2016-17",{"$nulls":6},"Ü"]
[null,null,"Times series data of either the number of FPNC clients or total FPNC expenditure. Data available for Scotland or by Local Authority and is presented in a table and charts."]
[null,"Table 2 -","Breakdown of FPNC provided to clients in a Care Home, 2007-08 to 2016-17",{"$nulls":6},"Ü"]
[null,null,"Times series data of either the number of FPNC clients or total FPNC expenditure within Care Homes. Data available for Scotland or by Local Authority and is presented in a table and charts."]
[null,"Table 3 -","Local Authority table of FPNC provided to clients in a Care Home, 2007-08 to 2016-17",{"$nulls":6},"Ü"]
[null,null,"Number of Care Home residents receiving FPNC by Local Authority. Allows for different data types to be presented by clients or expenditure and is presented in a table."]
[null,"Table 4 -","Breakdown of FPC provided to clients at home, 2007-08 to 2016-17",{"$nulls":6},"Ü"]
[null,null,"Times series data of either the number of FPNC clients or total FPNC expenditure receiving care at home. Data available for Scotland or by Local Authority and is presented in a table and charts."]
[null,"Table 5 -","Local Authority table of FPC provided to clients at home, 2007-08 to 2016-17",{"$nulls":6},"Ü"]
[null,null,"Number of home care clients receiving FPC by Local Authority. Allows for different data types to be presented by clients or expenditure and is presented in a table."]
[]
[]
[null,"Problem with drop down lists"]
[]
[null,"If the drop down lists are not working please ensure that Macro security settings are set to medium. To do this, go to ‘Tools’ menu and select ‘macro’. Then select ‘Security’ and ensure that the security setting is set to either ‘Medium’ or ‘Low’ (Medium is the recommended option). If your settings were set to ‘High’ you should reset the level when you have finished working with the template.  Also when opening the file you will be asked whether you wish to “enable” or disable” macros. You must select “Enable macros”, otherwise the template will not function correctly."]

{"sheet":"Background notes","index":3,"n_rows":109,"n_cols":2,"rows_kept":109}
[null,"Background information"]
[]
[null,"Data Sources"]
[]
[null,"A variety of different data sources were used to compile this Statistics Release, as detailed below:"]
[]
[null,"Community Care Quarterly key monitoring return"]
[null,"Since July 2002, the Scottish Executive - followed by the Scottish Government - has collected quarterly information on the number of people receiving personal care services at home and the number of self-funders receiving free personal care and free nursing care payments.  The numbers represent only those people receiving FPC and FNC under the Community Care and Health (Scotland) Act 2002.  "]
[]
[null,"For Care Homes, this provides a count of those people who are self-funders and are assessed as requiring free personal care and/or free nursing care.  "]
[]
[null,"For Home Care, the figures show all people receiving personal care services at home.  Many of these people would have received their personal care for free prior to the introduction of the Community Care and Health (Scotland) Act 2002, but prior to July 2002 this was dependent on local policy and the client’s financial status.  It is estimated that Local authorities spent at least £64.5 million in 2001-02 on providing personal care services.  Full details available from:"]
[null,"http://www.scotland.gov.uk/Topics/Statistics/Browse/Health/Data/FPNC "]
[]
[null,"The results of the quarterly survey are available at:"]
[null,"http://www.scotland.gov.uk/Topics/Statistics/Browse/Health/Data/QuarterlySurvey"]
[]
[null,"A copy of the survey form and notes for guidance is available at:"]
[null,"http://www.scotland.gov.uk/Topics/Statistics/Browse/Health/DataSupplier"]
[]
[null,"Up until 2011-12, this survey was conducted on a quarterly basis and the average of the four quarters was taken to produce an annual figure. However, since 2012-13 this survey has been conducted during the final quarter of the year only. This means that from 2012-13, the figures show a snapshot of the year rather than the average across the year."]
[]
[null,"Home Care Census / Social Care Survey"]
[null,"Information on Home Care services has been collected since the 1980's by means of an annual census. The census covers all Home Care services provided or purchased by Scottish Local Authorities."]
[]
[null,"An aggregated table return for the Home Care statistical collection, called the H1, was introduced in 1998. Local authorities were asked to provide details of all Home Care services provided by their own staff, and in addition, services bought in from other local authorities, and private / voluntary organisations. Information on client age, for level and type of service was introduced to the collection in 2005."]
[]
[null,"The information collected in the Home Care census was reviewed by the Home Care review group. A revised Home Care statistical collection was introduced in March 2010 which collected information on an individual basis for each Home Care client receiving home help services, meals services and community alarm / telecare services. From March 2013, this was merged with the Self-Directed Support / Direct Payments publication into the Social Care Survey. Further information is available from: "]
[null,"http://www.scotland.gov.uk/Topics/Statistics/Browse/Health/Data/HomeCare"]
[]
[null,"Local Financial Return (LFR3)"]
[null,"The Local Financial Return collects expenditure statistics for each local authority in Scotland.  The LFR3 collects all expenditure and income relating to social work services.  From 2004-05, questions relating to expenditure on free personal care were added to the LFR3 return.  Further information is available from:"]
[null," http://www.scotland.gov.uk/Topics/Statistics/Browse/Local-Government-Finance"]
[]
[null,"Each year, data validation work is conducted on each of these sources before the official publication of the Free Personal and Nursing Care statistics.  As part of the 2016-17 validation process, each Local Authority was sent a spreadsheet summarising their statistics and flagging up any anomalies.  A blank copy of this spreadsheet can be found on our website at: "]
[null,"http://www.scotland.gov.uk/Topics/Statistics/Browse/Health/FPNC"]
[]
[]
[null,"Understanding the Statistics in this Report."]
[]
[null,"All information in this Statistics Release is presented for the financial years - from 1st April to 31st March.  Information is reported for a rolling ten-year period, which in the case of this release is from 2007-08 to 2016-17."]
[]
[null,"Care Homes"]
[null,"In general, care should be taken when comparing the data on ‘numbers’ of people receiving Free Personal Care and ‘expenditure’ on Free Personal Care.  The number of people receiving FPC and FNC payments is collected for the last 3 months of the financial year and so represents the number of people receiving payments at the end of March each year, rather than for the whole financial year."]
[]
[null,"Due to the large number of admissions and discharges throughout the year, this does not necessarily represent the number of people receiving FPC for the full 52 weeks of the year.  In the year to March 2016, there were 14,400 long-stay admissions to Care Homes for older people in Scotland (ISD Care Home Census).  This represents almost 277 long-stay admissions every week."]
[]
[]
[null,"Home Care"]
[null,"As with the Care Homes data, the data for clients receiving personal care services at home provides a snapshot at the end of the financial year.  This will not compare directly with the expenditure data which takes into account variations across the whole financial year.  From 2009-10 onwards the Home Care Census (and from 2012-13 the Social Care Survey) has been used to provide the number of Home Care clients at the end of March each year."]
[]
[]
[null,"Limitations of the Data"]
[]
[null,"The CIPFA Best Value Accounting Code of Practice (BVACOP), Requires the inclusion of overheads within expenditure.  For both Care Homes and Care at Home expenditure, since 2006-07 the LFR3 has required Local Authorities to include overheads in line with the BVACOP."]
[]
[null,"Due to the identification that overheads were not being included consistently within expenditure figures by Local Authorities. In the 2011 publication a revised time series for expenditure on FPNC payments from 2003-04 to 2008-09 was published, after extensive work to ensure that all figures included overheads. "]
[]
[null,"Since the 2009-10 validation exercise, Local Authorities have been asked to confirm if their expenditure figures firstly contained overhead figures and then to either detail the amount included or to provide an estimate of that amount. "]
[]
[null,"For some local authorities it appears that gross expenditure on personal care services at home is higher than overall net expenditure on Home Care services for certain years.  This can happen for a number of reasons:"]
[]
[null,"• Where resource transfer from Health Boards has been included as income against Home Care services for older people."]
[null,"• Where supporting people grant has been included as income against Home Care services for older people."]
[null,"• Where the personal care expenditure includes overheads but the Home Care expenditure returned in the LFR3 did not include an allocation of overheads."]
[]
[null,"Many Local Authorities have seen a rise in personal care at home costs from 2006-07.  The reasons for this are not just increased demand but also:"]
[]
[null,"• A shift in the balance of care, away from care homes towards more care at home."]
[null,"• The introduction of equal pay provision resulting in higher wage costs."]
[null,"• The provision of refunds to clients for meal preparation where this was previously charged for."]
[]
[]
[null,"Support Services"]
[]
[null,"There were several changes to the format of the relevant Local Government Finance return (LFR03) that Local Authorities submitted to the Scottish Government from 2012-13 onwards. Most notable was the introduction of a separate “Support Services” row, which includes expenditure on Finance, Legal, Human Resources, IT, Internal Audit, Procurement and Asset Management. This figure would previously have been spread across other rows representing specific service types (e.g. Net Expenditure in Care Homes). "]
[]
[null,"In order to make the figures from 2012-13 onwards presented here as comparable as possible with previous years, Net Expenditure in Care Homes and Net Expenditure on Home Care have been adjusted to account for the change in Support Services recording. This adjustment involves apportioning a fraction of the total Net Support Services expenditure for Older People to the Net Care Home / Home Care expenditure. This fraction to be applied is calculated using Gross Expenditure, in order to avoid negative values. The expenditure figures for Free Personal and/or Nursing Care have been validated by each Local Authority to include overheads in line with previous years, therefore these figures have not been adjusted to include Support Services."]
[null," "]
[]
[null,"Changes to the data"]
[]
[null,"During the data validation process, some Local Authorities identified errors within data returns this has resulted in previously published figures being revised for some tables. This also means that figures will differ slightly from those within source publications. It should be noted that the revisions made at Local Authority level generally have a comparatively tiny effect on the Scotland figures. "]
[]
[]
[null,"Data estimation"]
[]
[null,"In 2016-17, expenditure on Free Personal and Nursing Care in Care Homes was estimated for Scottish Borders. This was due to an observed discrepancy between expenditure and the number of clients receiving Free Personal and Nursing Care in Care Homes. To estimate the expenditure, the standard weekly payments were first multiplied by the number of clients receiving payments in Care Homes. "]
[]
[null,"Home Care expenditure was also estimated for Scottish Borders in 2016-17. This was due to all expenditure on Home Care being recorded in the 'Other' category in the LFR03 return.  To estimate expenditure, the hourly rate (£17.62) for Free Personal Care provided at home across Scotland in 2015-16 was estimated and multiplied by the total number of Free Personal Care at home hours in each local authority in 2016-17. "]
[]
[]
[null,"Further information"]
[]
[null,"Further details and analysis of the data presented in this Statistics Release are available on request from the address given below. The Statistics Release is available on the Internet by accessing the Scottish Government web site: "]
[null,"http://www.scotland.gov.uk/Topics/Statistics/Browse/Health/Publications"]
[]
[null,"Information at local authority level is shown in the spreadsheet accompanying this Statistics Release."]
[]
[null,"Contact: Steven Gillespie"]
[null,"Basement Rear"]
[null,"St Andrews House"]
[null,"Edinburgh"]
[null,"EH1 3DG"]
[]
[null,"Tel: 0131 244 3777"]
[null,"E-mail: SWStat@gov.scot"]
[]
[null,"This statistics release was published on 31 July 2018."]

{"sheet":"Table1","index":4,"n_rows":45,"n_cols":39,"rows_kept":45,"merged":[[16,2,16,12]]}
[null,{"$f":"IF($A$6=\"Clients\",(\"Number of clients receiving FPNC in \"&A5&\", 2007-08 to 2016-17\"),IF($A$6=\"Expenditure (£thousands - including overheads)\",(\"FPNC Expenditure (including overheads) in \"&A5&\", 2007-08 to 2016-17\"),(\"FPNC Expenditure (excluding overheads) in \"&A5&\", 2007-08 to 2016-17\")))","v":"FPNC Expenditure (excluding overheads) in Scotland, 2007-08 to 2016-17"},{"$nulls":10},"Main page"]
[]
[null,null,"Select Local Authority:",null,null,"Select client or expenditure data:",{"$nulls":6},"Background notes"]
[]
["Scotland"," "]
["Expenditure (£thousands - excluding overheads)"," ",{"$nulls":6},{"$f":"IF(A6=\"Expenditure\",\"£000's\",\"\")","v":""},{"$nulls":20},"07-08","08-09","09-10","10-11","11-12","12-13","13-14","14-15","15-16","16-17"]
[{"$nulls":3},"2007-08","2008-09","2009-10","2010-11","2011-12","2012-13","2013-14","2014-15","2015-16","2016-17",{"$nulls":16},"2007-08","2008-09","2009-10","2010-11","2011-12","2012-13","2013-14","2014-15","2015-16","2016-17"]
[{"$f":"IF($A$6=\"Clients\",5,IF($A$6=\"Expenditure (£thousands - including overheads)\",14,19))","v":19},null,"Self-funders clients receiving FPNC in a Care Homes",{"$f":"VLOOKUP($A$5&D$7,Data!$B$4:$V$333,$A8,FALSE)","v":{"v":93748,"d":"93,748"}},{"$f":"VLOOKUP($A$5&E$7,Data!$B$4:$V$333,$A8,FALSE)","v":{"v":94166,"d":"94,166"}},{"$f":"VLOOKUP($A$5&F$7,Data!$B$4:$V$333,$A8,FALSE)","v":{"v":94803,"d":"94,803"}},{"$f":"VLOOKUP($A$5&G$7,Data!$B$4:$V$333,$A8,FALSE)","v":{"v":95628,"d":"95,628"}},{"$f":"VLOOKUP($A$5&H$7,Data!$B$4:$V$333,$A8,FALSE)","v":{"v":99209,"d":"99,209"}},{"$f":"VLOOKUP($A$5&I$7,Data!$B$4:$V$333,$A8,FALSE)","v":{"v":106659,"d":"106,659"}},{"$f":"VLOOKUP($A$5&J$7,Data!$B$4:$V$333,$A8,FALSE)","v":{"v":109275,"d":"109,275"}},{"$f":"VLOOKUP($A$5&K$7,Data!$B$4:$V$333,$A8,FALSE)","v":{"v":112870,"d":"112,870"}},{"$f":"VLOOKUP($A$5&L$7,Data!$B$4:$V$333,$A8,FALSE)","v":{"v":112173,"d":"112,173"}},{"$f":"VLOOKUP($A$5&M$7,Data!$B$4:$V$333,$A8,FALSE)","v":{"v":109200,"d":"109,200"}},{"$nulls":15},"Self-funders clients receiving FPNC in a Care Homes",{"$f":"D8","v":{"v":93748,"d":"93,748"}},{"v":94166,"d":"94,166"},{"v":94803,"d":"94,803"},{"v":95628,"d":"95,628"},{"v":99209,"d":"99,209"},{"v":106659,"d":"106,659"},{"v":109275,"d":"109,275"},{"v":112870,"d":"112,870"},{"v":112173,"d":"112,173"},{"v":109200,"d":"109,200"}]
[{"$f":"IF($A$6=\"Clients\",9,IF($A$6=\"Expenditure (£thousands - including overheads)\",16,20))","v":20},null,"Clients aged 65+ receiving FPC at home",{"$f":"VLOOKUP($A$5&D$7,Data!$B$4:$V$333,$A9,FALSE)","v":{"v":238160,"d":"238,160"}},{"$f":"VLOOKUP($A$5&E$7,Data!$B$4:$V$333,$A9,FALSE)","v":{"v":246516,"d":"246,516"}},{"$f":"VLOOKUP($A$5&F$7,Data!$B$4:$V$333,$A9,FALSE)","v":{"v":280836,"d":"280,836"}},{"$f":"VLOOKUP($A$5&G$7,Data!$B$4:$V$333,$A9,FALSE)","v":{"v":306402,"d":"306,402"}},{"$f":"VLOOKUP($A$5&H$7,Data!$B$4:$V$333,$A9,FALSE)","v":{"v":315800,"d":"315,800"}},{"$f":"VLOOKUP($A$5&I$7,Data!$B$4:$V$333,$A9,FALSE)","v":{"v":320870,"d":"320,870"}},{"$f":"VLOOKUP($A$5&J$7,Data!$B$4:$V$333,$A9,FALSE)","v":{"v":327383,"d":"327,383"}},{"$f":"VLOOKUP($A$5&K$7,Data!$B$4:$V$333,$A9,FALSE)","v":{"v":330647,"d":"330,647"}},{"$f":"VLOOKUP($A$5&L$7,Data!$B$4:$V$333,$A9,FALSE)","v":{"v":340011,"d":"340,011"}},{"$f":"VLOOKUP($A$5&M$7,Data!$B$4:$V$333,$A9,FALSE)","v":{"v":346149,"d":"346,149"}},{"$nulls":15},"Clients aged 65+ receiving FPC at home",{"v":238160,"d":"238,160"},{"v":246516,"d":"246,516"},{"v":280836,"d":"280,836"},{"v":306402,"d":"306,402"},{"v":315800,"d":"315,800"},{"v":320870,"d":"320,870"},{"v":327383,"d":"327,383"},{"v":330647,"d":"330,647"},{"v":340011,"d":"340,011"},{"v":346149,"d":"346,149"}]
[null,null,"Total",{"$f":"SUM(D8:D9)","v":{"v":331908,"d":"331,908"}},{"$f":"SUM(E8:E9)","v":{"v":340682,"d":"340,682"}},{"$f":"SUM(F8:F9)","v":{"v":375639,"d":"375,639"}},{"$f":"SUM(G8:G9)","v":{"v":402030,"d":"402,030"}},{"$f":"SUM(H8:H9)","v":{"v":415009,"d":"415,009"}},{"v":427529,"d":"427,529"},{"v":436658,"d":"436,658"},{"v":443517,"d":"443,517"},{"v":452184,"d":"452,184"},{"v":455349,"d":"455,349"},{"$nulls":15},"Total",{"v":331908,"d":"331,908"},{"v":340682,"d":"340,682"},{"v":375639,"d":"375,639"},{"v":402030,"d":"402,030"},{"v":415009,"d":"415,009"},{"v":427529,"d":"427,529"},{"v":436658,"d":"436,658"},{"v":443517,"d":"443,517"},{"v":452184,"d":"452,184"},{"v":455349,"d":"455,349"}]
[]
[21,null,"Population aged 65+",{"$f":"VLOOKUP($A$5&D$7,Data!$B$4:$Z$333,$A12,FALSE)","v":{"v":846005,"d":"846,005"}},{"$f":"VLOOKUP($A$5&E$7,Data!$B$4:$Z$333,$A12,FALSE)","v":{"v":857746,"d":"857,746"}},{"$f":"VLOOKUP($A$5&F$7,Data!$B$4:$Z$333,$A12,FALSE)","v":{"v":870557,"d":"870,557"}},{"$f":"VLOOKUP($A$5&G$7,Data!$B$4:$Z$333,$A12,FALSE)","v":{"v":882222,"d":"882,222"}},{"$f":"VLOOKUP($A$5&H$7,Data!$B$4:$Z$333,$A12,FALSE)","v":{"v":935192,"d":"935,192"}},{"$f":"VLOOKUP($A$5&I$7,Data!$B$4:$Z$333,$A12,FALSE)","v":{"v":925741,"d":"925,741"}},{"$f":"VLOOKUP($A$5&J$7,Data!$B$4:$Z$333,$A12,FALSE)","v":{"v":946898,"d":"946,898"}},{"$f":"VLOOKUP($A$5&K$7,Data!$B$4:$Z$333,$A12,FALSE)","v":{"v":968450,"d":"968,450"}},{"$f":"VLOOKUP($A$5&L$7,Data!$B$4:$Z$333,$A12,FALSE)","v":{"v":982998,"d":"982,998"}},{"$f":"VLOOKUP($A$5&M$7,Data!$B$4:$Z$333,$A12,FALSE)","v":{"v":998852,"d":"998,852"}},{"$nulls":15},"Population aged 65+",{"$f":"D12","v":{"v":846005,"d":"846,005"}},{"v":857746,"d":"857,746"},{"v":870557,"d":"870,557"},{"v":882222,"d":"882,222"},{"v":935192,"d":"935,192"},{"v":925741,"d":"925,741"},{"v":946898,"d":"946,898"},{"v":968450,"d":"968,450"},{"v":982998,"d":"982,998"},{"v":998852,"d":"998,852"}]
[null,null,"Rate per 1,000 population aged 65+",{"$f":"D10/D$12*1000","v":{"v":392.3239224354466,"d":"392.32"}},{"$f":"E10/E$12*1000","v":{"v":397.18284900191895,"d":"397.18"}},{"$f":"F10/F$12*1000","v":{"v":431.4927109884821,"d":"431.49"}},{"$f":"G10/G$12*1000","v":{"v":455.70162612131645,"d":"455.70"}},{"v":443.76876619988195,"d":"443.77"},{"v":461.82355540048457,"d":"461.82"},{"v":461.1457622679528,"d":"461.15"},{"v":457.96582167380865,"d":"457.97"},{"v":460.0050050966533,"d":"460.01"},{"v":455.87234144798225,"d":"455.87"},{"$nulls":15},"Rate per 1,000 population aged 65+",{"v":392.3239224354466,"d":"392"},{"v":397.18284900191895,"d":"397"},{"v":431.4927109884821,"d":"431"},{"v":455.70162612131645,"d":"456"},{"v":443.76876619988195,"d":"444"},{"v":461.82355540048457,"d":"462"},{"v":461.1457622679528,"d":"461"},{"v":457.96582167380865,"d":"458"},{"v":460.0050050966533,"d":"460"},{"v":455.87234144798225,"d":"456"}]
[]
[null,null,"Source: Community Care Quarterly Key Monitoring Return (Client data), Social Care Survey 2013 onwards, FPNC survey and LFR3 (Expenditure data), NRS mid-year estimates (population data)"]
[null,null,{"$f":"IF($A$6=\"Clients\",\"FPNC figures are yearly averages rounded to the nearest 10.\",IF($A$6=\"Expenditure (Inc Overheads)\",\"FPNC figures are in £thousands and include overheads.\",\"FPNC figures are in £thousands and exclude overheads.\"))","v":"FPNC figures are in £thousands and exclude overheads."}]
[null,null,{"$f":"IF($A$5=\"Dumfries & Galloway\", C43, \"\")","v":""}]
[]
[]
[null,null,{"$f":"IF($A$6=\"Clients\",\"Chart 1 - Number of clients receiving FPNC\",IF($A$6=\"Expenditure (£thousands - including overheads)\",\"Chart 1 - FPNC Expenditure (including overheads)\",\"Chart 1 - FPNC Expenditure (excluding overheads)\"))","v":"Chart 1 - FPNC Expenditure (excluding overheads)"},{"$nulls":3},{"$f":"IF($A$6=\"Clients\",\"Chart 2 - FPNC client rate per 1,000 population aged 65+\",\"Chart 2 - Expenditure rate per 1,000 population aged 65+\")","v":"Chart 2 - Expenditure rate per 1,000 population aged 65+"}]
{"$rows_empty":22}
[null,null,"The system used to report the number of clients in care homes in Dumfries & Galloway has recently been updated to properly reflect the number of self-funders in receipt of free personal and nursing care. This means that client numbers for Dumfries & Galloway in 2016/17 are not strictly comparable with previous years."]
[null,null,"in receipt of free personal and nursing care. This means that client numbers in 2016/17 are not strictly comparable with previous years."]
[null,null,{"$f":"$A$43&$A$44","v":""}]

{"sheet":"Table2","index":5,"n_rows":43,"n_cols":40,"rows_kept":43,"merged":[[16,2,16,12]]}
[null,{"$f":"IF($A$6=\"Clients\",(\"Number of self-funders within Care Homes receiving FPNC in \"& A5&\", 2007-08 to 2016-17\"),(\"Expenditure in Care Homes on FPNC in \"& A5&\", 2007-08 to 2016-17\"))","v":"Number of self-funders within Care Homes receiving FPNC in Scotland, 2007-08 to 2016-17"},{"$nulls":10},"Main page"]
[]
[null,null,"Select Local Authority:",null,null,"Select client or expenditure data:",{"$nulls":6},"Background notes"]
[]
["Scotland"," "]
["Clients"," ",{"$nulls":6},{"$f":"IF(A6=\"Expenditure\",\"£000's\",\"\")","v":""},{"$nulls":21},"07-08","08-09","09-10","10-11","11-12","12-13","13-14","14-15","15-16","16-17"]
[{"$nulls":3},"2007-08","2008-09","2009-10","2010-11","2011-12","2012-13","2013-14","2014-15","2015-16","2016-17",{"$nulls":17},"2007-08","2008-09","2009-10","2010-11","2011-12","2012-13","2013-14","2014-15","2015-16","2016-17"]
[{"$f":"IF($A$6=\"Clients\",4,11)","v":4},null,"Long-stay residents aged 65+ supported in care homes",{"$f":"VLOOKUP($A$5&D$7,Data!$B$4:$V$333,$A8,FALSE)","v":{"v":31730,"d":"31,730"}},{"$f":"VLOOKUP($A$5&E$7,Data!$B$4:$V$333,$A8,FALSE)","v":{"v":31530,"d":"31,530"}},{"$f":"VLOOKUP($A$5&F$7,Data!$B$4:$V$333,$A8,FALSE)","v":{"v":31470,"d":"31,470"}},{"$f":"VLOOKUP($A$5&G$7,Data!$B$4:$V$333,$A8,FALSE)","v":{"v":31020,"d":"31,020"}},{"$f":"VLOOKUP($A$5&H$7,Data!$B$4:$V$333,$A8,FALSE)","v":{"v":30750,"d":"30,750"}},{"$f":"VLOOKUP($A$5&I$7,Data!$B$4:$V$333,$A8,FALSE)","v":{"v":30260,"d":"30,260"}},{"$f":"VLOOKUP($A$5&J$7,Data!$B$4:$V$333,$A8,FALSE)","v":{"v":30800,"d":"30,800"}},{"$f":"VLOOKUP($A$5&K$7,Data!$B$4:$V$333,$A8,FALSE)","v":{"v":30520,"d":"30,520"}},{"$f":"VLOOKUP($A$5&L$7,Data!$B$4:$V$333,$A8,FALSE)","v":{"v":30800,"d":"30,800"}},{"$f":"VLOOKUP($A$5&M$7,Data!$B$4:$V$333,$A8,FALSE)","v":{"v":30670,"d":"30,670"}},{"$nulls":16},"Long-stay residents aged 65+ supported in care homes",{"$f":"D8","v":{"v":31730,"d":"31,730"}},{"v":31530,"d":"31,530"},{"v":31470,"d":"31,470"},{"v":31020,"d":"31,020"},{"v":30750,"d":"30,750"},{"v":30260,"d":"30,260"},{"v":30800,"d":"30,800"},{"v":30520,"d":"30,520"},{"$f":"L8","v":{"v":30800,"d":"30,800"}},{"v":30670,"d":"30,670"}]
[{"$f":"IF($A$6=\"Clients\",5,IF($A$6=\"Expenditure (£thousands - including overheads)\",14,19))","v":5},null,"Self-funders receiving FPNC in Care Homes",{"$f":"VLOOKUP($A$5&D$7,Data!$B$4:$V$333,$A9,FALSE)","v":{"v":9590,"d":"9,590"}},{"$f":"VLOOKUP($A$5&E$7,Data!$B$4:$V$333,$A9,FALSE)","v":{"v":9640,"d":"9,640"}},{"$f":"VLOOKUP($A$5&F$7,Data!$B$4:$V$333,$A9,FALSE)","v":{"v":9380,"d":"9,380"}},{"$f":"VLOOKUP($A$5&G$7,Data!$B$4:$V$333,$A9,FALSE)","v":{"v":9550,"d":"9,550"}},{"$f":"VLOOKUP($A$5&H$7,Data!$B$4:$V$333,$A9,FALSE)","v":{"v":9720,"d":"9,720"}},{"$f":"VLOOKUP($A$5&I$7,Data!$B$4:$V$333,$A9,FALSE)","v":{"v":9580,"d":"9,580"}},{"$f":"VLOOKUP($A$5&J$7,Data!$B$4:$V$333,$A9,FALSE)","v":{"v":9840,"d":"9,840"}},{"$f":"VLOOKUP($A$5&K$7,Data!$B$4:$V$333,$A9,FALSE)","v":{"v":9910,"d":"9,910"}},{"$f":"VLOOKUP($A$5&L$7,Data!$B$4:$V$333,$A9,FALSE)","v":{"v":9870,"d":"9,870"}},{"$f":"VLOOKUP($A$5&M$7,Data!$B$4:$V$333,$A9,FALSE)","v":{"v":9910,"d":"9,910"}},{"$nulls":16},"Self-funders receiving FPNC or FPC only or FNC only in Care Homes",{"v":9590,"d":"9,590"},{"v":9640,"d":"9,640"},{"v":9380,"d":"9,380"},{"v":9550,"d":"9,550"},{"v":9720,"d":"9,720"},{"v":9580,"d":"9,580"},{"v":9840,"d":"9,840"},{"v":9910,"d":"9,910"},{"v":9870,"d":"9,870"},{"v":9910,"d":"9,910"}]
[null,null,"Percentage receiving FPNC",{"$f":"D9/D8","v":{"v":0.30223763000315157,"d":"30%"}},{"$f":"E9/E8","v":{"v":0.30574056454170634,"d":"31%"}},{"$f":"F9/F8","v":{"v":0.29806164601207497,"d":"30%"}},{"$f":"G9/G8","v":{"v":0.30786589297227596,"d":"31%"}},{"v":0.31609756097560976,"d":"32%"},{"v":0.3165895571711831,"d":"32%"},{"v":0.3194805194805195,"d":"32%"},{"v":0.3247051114023591,"d":"32%"},{"v":0.32045454545454544,"d":"32%"},{"v":0.3231170524942941,"d":"32%"},{"$nulls":16},"Percentage receiving FPNC",{"v":0.30223763000315157,"d":"30%"},{"v":0.30574056454170634,"d":"31%"},{"v":0.29806164601207497,"d":"30%"},{"v":0.30786589297227596,"d":"31%"},{"v":0.31609756097560976,"d":"32%"},{"v":0.3165895571711831,"d":"32%"},{"v":0.3194805194805195,"d":"32%"},{"v":0.3247051114023591,"d":"32%"},{"v":0.32045454545454544,"d":"32%"},{"v":0.3231170524942941,"d":"32%"}]
[]
[{"$f":"IF($A$6=\"Clients\",6,IF($A$6=\"Expenditure (£thousands - including overheads)\",12,17))","v":6},null,"Self-funders 65+ receiving FPC in Care Homes",{"$f":"VLOOKUP($A$5&D$7,Data!$B$4:$V$333,$A12,FALSE)","v":{"v":9510,"d":"9,510"}},{"$f":"VLOOKUP($A$5&E$7,Data!$B$4:$V$333,$A12,FALSE)","v":{"v":9580,"d":"9,580"}},{"$f":"VLOOKUP($A$5&F$7,Data!$B$4:$V$333,$A12,FALSE)","v":{"v":9330,"d":"9,330"}},{"$f":"VLOOKUP($A$5&G$7,Data!$B$4:$V$333,$A12,FALSE)","v":{"v":9490,"d":"9,490"}},{"$f":"VLOOKUP($A$5&H$7,Data!$B$4:$V$333,$A12,FALSE)","v":{"v":9660,"d":"9,660"}},{"$f":"VLOOKUP($A$5&I$7,Data!$B$4:$V$333,$A12,FALSE)","v":{"v":9520,"d":"9,520"}},{"$f":"VLOOKUP($A$5&J$7,Data!$B$4:$V$333,$A12,FALSE)","v":{"v":9780,"d":"9,780"}},{"$f":"VLOOKUP($A$5&K$7,Data!$B$4:$V$333,$A12,FALSE)","v":{"v":9870,"d":"9,870"}},{"$f":"VLOOKUP($A$5&L$7,Data!$B$4:$V$333,$A12,FALSE)","v":{"v":9820,"d":"9,820"}},{"$f":"VLOOKUP($A$5&M$7,Data!$B$4:$V$333,$A12,FALSE)","v":{"v":9870,"d":"9,870"}},{"$nulls":16},"Self-funders 65+ receiving FPC in Care Homes",{"$f":"D12","v":{"v":9510,"d":"9,510"}},{"v":9580,"d":"9,580"},{"v":9330,"d":"9,330"},{"v":9490,"d":"9,490"},{"v":9660,"d":"9,660"},{"v":9520,"d":"9,520"},{"v":9780,"d":"9,780"},{"v":9870,"d":"9,870"},{"$f":"L12","v":{"v":9820,"d":"9,820"}},{"$f":"M12","v":{"v":9870,"d":"9,870"}}]
[{"$f":"IF($A$6=\"Clients\",7,IF($A$6=\"Expenditure (£thousands - including overheads)\",13,18))","v":7},null,"Self-funders receiving FNC in Care Homes",{"$f":"VLOOKUP($A$5&D$7,Data!$B$4:$V$333,$A13,FALSE)","v":{"v":6130,"d":"6,130"}},{"$f":"VLOOKUP($A$5&E$7,Data!$B$4:$V$333,$A13,FALSE)","v":{"v":6180,"d":"6,180"}},{"$f":"VLOOKUP($A$5&F$7,Data!$B$4:$V$333,$A13,FALSE)","v":{"v":5960,"d":"5,960"}},{"$f":"VLOOKUP($A$5&G$7,Data!$B$4:$V$333,$A13,FALSE)","v":{"v":6000,"d":"6,000"}},{"$f":"VLOOKUP($A$5&H$7,Data!$B$4:$V$333,$A13,FALSE)","v":{"v":6050,"d":"6,050"}},{"$f":"VLOOKUP($A$5&I$7,Data!$B$4:$V$333,$A13,FALSE)","v":{"v":6130,"d":"6,130"}},{"$f":"VLOOKUP($A$5&J$7,Data!$B$4:$V$333,$A13,FALSE)","v":{"v":6030,"d":"6,030"}},{"$f":"VLOOKUP($A$5&K$7,Data!$B$4:$V$333,$A13,FALSE)","v":{"v":6080,"d":"6,080"}},{"$f":"VLOOKUP($A$5&L$7,Data!$B$4:$V$333,$A13,FALSE)","v":{"v":6040,"d":"6,040"}},{"$f":"VLOOKUP($A$5&M$7,Data!$B$4:$V$333,$A13,FALSE)","v":{"v":5940,"d":"5,940"}},{"$nulls":16},"Self-funders receiving FNC in Care Homes",{"v":6130,"d":"6,130"},{"v":6180,"d":"6,180"},{"v":5960,"d":"5,960"},{"v":6000,"d":"6,000"},{"v":6050,"d":"6,050"},{"v":6130,"d":"6,130"},{"v":6030,"d":"6,030"},{"v":6080,"d":"6,080"},{"$f":"L13","v":{"v":6040,"d":"6,040"}},{"$f":"M13","v":{"v":5940,"d":"5,940"}}]
[]
[null,null,"Source: Community Care Quarterly Key Monitoring Return (Client data), Social Care Survey 2013 onwards, FPNC survey and LFR3 (Expenditure data), NRS mid-year estimates (population data)"]
[null,null,{"$f":"IF($A$6=\"Clients\",\"FNPC figures are yearly averages rounded to the nearest 10.\",IF($A$6=\"Expenditure (Inc Overheads)\",\"Expenditure figures are in £thousands. Overheads are included in all FPNC figures\",\"FPC figures are in £thousands. Overheads are excluded from all FPNC figures\"))","v":"FNPC figures are yearly averages rounded to the nearest 10."}]
[null,null,{"$f":"IF($A$5=\"Dumfries & Galloway\", C43, \"\")","v":""}]
[]
[null,null,{"$f":"IF($A$6=\"Clients\",\"Chart 1 - Number of clients receiving FPNC\",IF($A$6=\"Expenditure (£thousands - including overheads)\",\"Chart 1 - FPNC Expenditure (including overheads)\",\"Chart 1 - FPNC Expenditure (excluding overheads)\"))","v":"Chart 1 - Number of clients receiving FPNC"},{"$nulls":3},{"$f":"IF($A$6=\"Clients\",\"Chart 2 - Percentage of long stay residents receiving FPNC\",\"Chart 2 - Percentage of Care home expenditure on FPNC\")","v":"Chart 2 - Percentage of long stay residents receiving FPNC"}]
{"$rows_empty":23}
[null,null,"The system used to report the number of clients in care homes in Dumfries & Galloway has recently been updated to properly reflect the number of self-funders in receipt of free personal and nursing care. This means that client numbers for Dumfries & Galloway in 2016/17 are not strictly comparable with previous years."]

{"sheet":"Table3","index":6,"n_rows":44,"n_cols":13,"rows_kept":44,"merged":[[43,2,43,12]]}
[null,{"$f":"IF(A6=\"Clients\",(\"Number of  \"&A5&\", 2007-08 to 2016-17\"),IF(A4=\"Long\",(\"Net expenditure on \"&A5&\", 2007-08 to 2016-17\"),(\"Expenditure on \"&A5&\", 2007-08 to 2016-17\")))","v":"Number of  Long-stay residents aged 65+ supported in Care Homes, 2007-08 to 2016-17"},{"$nulls":10},"Main page"]
[]
[null,null,"Select required data type:",{"$nulls":4},"Select client or expenditure data:",{"$nulls":4},"Background notes"]
[{"$f":"MID(A5,1,4)","v":"Long"}," "]
["Long-stay residents aged 65+ supported in Care Homes"," "]
["Clients"," "]
[{"$f":"IF(A6=\"Clients\",2,IF($A$6=\"Expenditure (£thousands - including overheads)\",3,4))","v":2},null,"Local Authority","2007-08","2008-09","2009-10","2010-11","2011-12","2012-13","2013-14","2014-15","2015-16","2016-17"]
[{"$f":"VLOOKUP(A5,Lookups!H2:K5,A7,FALSE)","v":4},null,"Aberdeen City",{"$f":"VLOOKUP($C8&D$7,Data!$B$4:$V$333,$A$8,FALSE)","v":{"v":1590,"d":"1,590"}},{"$f":"VLOOKUP($C8&E$7,Data!$B$4:$V$333,$A$8,FALSE)","v":{"v":1540,"d":"1,540"}},{"$f":"VLOOKUP($C8&F$7,Data!$B$4:$V$333,$A$8,FALSE)","v":{"v":1530,"d":"1,530"}},{"$f":"VLOOKUP($C8&G$7,Data!$B$4:$V$333,$A$8,FALSE)","v":{"v":1540,"d":"1,540"}},{"$f":"VLOOKUP($C8&H$7,Data!$B$4:$V$333,$A$8,FALSE)","v":{"v":1440,"d":"1,440"}},{"$f":"VLOOKUP($C8&I$7,Data!$B$4:$V$333,$A$8,FALSE)","v":{"v":1200,"d":"1,200"}},{"$f":"VLOOKUP($C8&J$7,Data!$B$4:$V$333,$A$8,FALSE)","v":{"v":1340,"d":"1,340"}},{"$f":"VLOOKUP($C8&K$7,Data!$B$4:$V$333,$A$8,FALSE)","v":{"v":1350,"d":"1,350"}},{"$f":"VLOOKUP($C8&L$7,Data!$B$4:$V$333,$A$8,FALSE)","v":{"v":1310,"d":"1,310"}},{"$f":"VLOOKUP($C8&M$7,Data!$B$4:$V$333,$A$8,FALSE)","v":{"v":1260,"d":"1,260"}}]
[null,null,"Aberdeenshire",{"$f":"VLOOKUP($C9&D$7,Data!$B$4:$V$333,$A$8,FALSE)","v":{"v":1360,"d":"1,360"}},{"$f":"VLOOKUP($C9&E$7,Data!$B$4:$V$333,$A$8,FALSE)","v":{"v":1380,"d":"1,380"}},{"$f":"VLOOKUP($C9&F$7,Data!$B$4:$V$333,$A$8,FALSE)","v":{"v":1360,"d":"1,360"}},{"$f":"VLOOKUP($C9&G$7,Data!$B$4:$V$333,$A$8,FALSE)","v":{"v":1350,"d":"1,350"}},{"$f":"VLOOKUP($C9&H$7,Data!$B$4:$V$333,$A$8,FALSE)","v":{"v":1350,"d":"1,350"}},{"$f":"VLOOKUP($C9&I$7,Data!$B$4:$V$333,$A$8,FALSE)","v":{"v":1370,"d":"1,370"}},{"$f":"VLOOKUP($C9&J$7,Data!$B$4:$V$333,$A$8,FALSE)","v":{"v":1410,"d":"1,410"}},{"$f":"VLOOKUP($C9&K$7,Data!$B$4:$V$333,$A$8,FALSE)","v":{"v":1410,"d":"1,410"}},{"$f":"VLOOKUP($C9&L$7,Data!$B$4:$V$333,$A$8,FALSE)","v":{"v":1480,"d":"1,480"}},{"$f":"VLOOKUP($C9&M$7,Data!$B$4:$V$333,$A$8,FALSE)","v":{"v":1450,"d":"1,450"}}]
[null,null,"Angus",{"$f":"VLOOKUP($C10&D$7,Data!$B$4:$V$333,$A$8,FALSE)","v":680},{"$f":"VLOOKUP($C10&E$7,Data!$B$4:$V$333,$A$8,FALSE)","v":620},{"$f":"VLOOKUP($C10&F$7,Data!$B$4:$V$333,$A$8,FALSE)","v":780},{"$f":"VLOOKUP($C10&G$7,Data!$B$4:$V$333,$A$8,FALSE)","v":840},{"$f":"VLOOKUP($C10&H$7,Data!$B$4:$V$333,$A$8,FALSE)","v":810},{"$f":"VLOOKUP($C10&I$7,Data!$B$4:$V$333,$A$8,FALSE)","v":740},{"$f":"VLOOKUP($C10&J$7,Data!$B$4:$V$333,$A$8,FALSE)","v":730},{"$f":"VLOOKUP($C10&K$7,Data!$B$4:$V$333,$A$8,FALSE)","v":710},{"$f":"VLOOKUP($C10&L$7,Data!$B$4:$V$333,$A$8,FALSE)","v":710},{"$f":"VLOOKUP($C10&M$7,Data!$B$4:$V$333,$A$8,FALSE)","v":750}]
[null,null,"Argyll & Bute",{"$f":"VLOOKUP($C11&D$7,Data!$B$4:$V$333,$A$8,FALSE)","v":790},{"$f":"VLOOKUP($C11&E$7,Data!$B$4:$V$333,$A$8,FALSE)","v":770},{"$f":"VLOOKUP($C11&F$7,Data!$B$4:$V$333,$A$8,FALSE)","v":690},{"$f":"VLOOKUP($C11&G$7,Data!$B$4:$V$333,$A$8,FALSE)","v":600},{"$f":"VLOOKUP($C11&H$7,Data!$B$4:$V$333,$A$8,FALSE)","v":560},{"$f":"VLOOKUP($C11&I$7,Data!$B$4:$V$333,$A$8,FALSE)","v":510},{"$f":"VLOOKUP($C11&J$7,Data!$B$4:$V$333,$A$8,FALSE)","v":510},{"$f":"VLOOKUP($C11&K$7,Data!$B$4:$V$333,$A$8,FALSE)","v":510},{"$f":"VLOOKUP($C11&L$7,Data!$B$4:$V$333,$A$8,FALSE)","v":520},{"$f":"VLOOKUP($C11&M$7,Data!$B$4:$V$333,$A$8,FALSE)","v":550}]
[null,null,"Clackmannanshire",{"$f":"VLOOKUP($C12&D$7,Data!$B$4:$V$333,$A$8,FALSE)","v":250},{"$f":"VLOOKUP($C12&E$7,Data!$B$4:$V$333,$A$8,FALSE)","v":240},{"$f":"VLOOKUP($C12&F$7,Data!$B$4:$V$333,$A$8,FALSE)","v":230},{"$f":"VLOOKUP($C12&G$7,Data!$B$4:$V$333,$A$8,FALSE)","v":230},{"$f":"VLOOKUP($C12&H$7,Data!$B$4:$V$333,$A$8,FALSE)","v":210},{"$f":"VLOOKUP($C12&I$7,Data!$B$4:$V$333,$A$8,FALSE)","v":220},{"$f":"VLOOKUP($C12&J$7,Data!$B$4:$V$333,$A$8,FALSE)","v":210},{"$f":"VLOOKUP($C12&K$7,Data!$B$4:$V$333,$A$8,FALSE)","v":200},{"$f":"VLOOKUP($C12&L$7,Data!$B$4:$V$333,$A$8,FALSE)","v":220},{"$f":"VLOOKUP($C12&M$7,Data!$B$4:$V$333,$A$8,FALSE)","v":230}]
[null,null,"Dumfries & Galloway",{"$f":"VLOOKUP($C13&D$7,Data!$B$4:$V$333,$A$8,FALSE)","v":870},{"$f":"VLOOKUP($C13&E$7,Data!$B$4:$V$333,$A$8,FALSE)","v":900},{"$f":"VLOOKUP($C13&F$7,Data!$B$4:$V$333,$A$8,FALSE)","v":910},{"$f":"VLOOKUP($C13&G$7,Data!$B$4:$V$333,$A$8,FALSE)","v":880},{"$f":"VLOOKUP($C13&H$7,Data!$B$4:$V$333,$A$8,FALSE)","v":930},{"$f":"VLOOKUP($C13&I$7,Data!$B$4:$V$333,$A$8,FALSE)","v":940},{"$f":"VLOOKUP($C13&J$7,Data!$B$4:$V$333,$A$8,FALSE)","v":960},{"$f":"VLOOKUP($C13&K$7,Data!$B$4:$V$333,$A$8,FALSE)","v":{"v":1000,"d":"1,000"}},{"$f":"VLOOKUP($C13&L$7,Data!$B$4:$V$333,$A$8,FALSE)","v":{"v":1050,"d":"1,050"}},{"$f":"VLOOKUP($C13&M$7,Data!$B$4:$V$333,$A$8,FALSE)","v":{"v":1110,"d":"1,110"}}]
[null,null,"Dundee City",{"$f":"VLOOKUP($C14&D$7,Data!$B$4:$V$333,$A$8,FALSE)","v":880},{"$f":"VLOOKUP($C14&E$7,Data!$B$4:$V$333,$A$8,FALSE)","v":960},{"$f":"VLOOKUP($C14&F$7,Data!$B$4:$V$333,$A$8,FALSE)","v":990},{"$f":"VLOOKUP($C14&G$7,Data!$B$4:$V$333,$A$8,FALSE)","v":960},{"$f":"VLOOKUP($C14&H$7,Data!$B$4:$V$333,$A$8,FALSE)","v":940},{"$f":"VLOOKUP($C14&I$7,Data!$B$4:$V$333,$A$8,FALSE)","v":970},{"$f":"VLOOKUP($C14&J$7,Data!$B$4:$V$333,$A$8,FALSE)","v":{"v":1060,"d":"1,060"}},{"$f":"VLOOKUP($C14&K$7,Data!$B$4:$V$333,$A$8,FALSE)","v":{"v":1050,"d":"1,050"}},{"$f":"VLOOKUP($C14&L$7,Data!$B$4:$V$333,$A$8,FALSE)","v":{"v":1030,"d":"1,030"}},{"$f":"VLOOKUP($C14&M$7,Data!$B$4:$V$333,$A$8,FALSE)","v":{"v":1030,"d":"1,030"}}]
[null,null,"East Ayrshire",{"$f":"VLOOKUP($C15&D$7,Data!$B$4:$V$333,$A$8,FALSE)","v":690},{"$f":"VLOOKUP($C15&E$7,Data!$B$4:$V$333,$A$8,FALSE)","v":700},{"$f":"VLOOKUP($C15&F$7,Data!$B$4:$V$333,$A$8,FALSE)","v":710},{"$f":"VLOOKUP($C15&G$7,Data!$B$4:$V$333,$A$8,FALSE)","v":740},{"$f":"VLOOKUP($C15&H$7,Data!$B$4:$V$333,$A$8,FALSE)","v":570},{"$f":"VLOOKUP($C15&I$7,Data!$B$4:$V$333,$A$8,FALSE)","v":710},{"$f":"VLOOKUP($C15&J$7,Data!$B$4:$V$333,$A$8,FALSE)","v":800},{"$f":"VLOOKUP($C15&K$7,Data!$B$4:$V$333,$A$8,FALSE)","v":720},{"$f":"VLOOKUP($C15&L$7,Data!$B$4:$V$333,$A$8,FALSE)","v":740},{"$f":"VLOOKUP($C15&M$7,Data!$B$4:$V$333,$A$8,FALSE)","v":730}]
[null,null,"East Dunbartonshire",{"$f":"VLOOKUP($C16&D$7,Data!$B$4:$V$333,$A$8,FALSE)","v":560},{"$f":"VLOOKUP($C16&E$7,Data!$B$4:$V$333,$A$8,FALSE)","v":590},{"$f":"VLOOKUP($C16&F$7,Data!$B$4:$V$333,$A$8,FALSE)","v":610},{"$f":"VLOOKUP($C16&G$7,Data!$B$4:$V$333,$A$8,FALSE)","v":580},{"$f":"VLOOKUP($C16&H$7,Data!$B$4:$V$333,$A$8,FALSE)","v":580},{"$f":"VLOOKUP($C16&I$7,Data!$B$4:$V$333,$A$8,FALSE)","v":610},{"$f":"VLOOKUP($C16&J$7,Data!$B$4:$V$333,$A$8,FALSE)","v":650},{"$f":"VLOOKUP($C16&K$7,Data!$B$4:$V$333,$A$8,FALSE)","v":640},{"$f":"VLOOKUP($C16&L$7,Data!$B$4:$V$333,$A$8,FALSE)","v":650},{"$f":"VLOOKUP($C16&M$7,Data!$B$4:$V$333,$A$8,FALSE)","v":680}]
[null,null,"East Lothian",{"$f":"VLOOKUP($C17&D$7,Data!$B$4:$V$333,$A$8,FALSE)","v":590},{"$f":"VLOOKUP($C17&E$7,Data!$B$4:$V$333,$A$8,FALSE)","v":570},{"$f":"VLOOKUP($C17&F$7,Data!$B$4:$V$333,$A$8,FALSE)","v":570},{"$f":"VLOOKUP($C17&G$7,Data!$B$4:$V$333,$A$8,FALSE)","v":600},{"$f":"VLOOKUP($C17&H$7,Data!$B$4:$V$333,$A$8,FALSE)","v":610},{"$f":"VLOOKUP($C17&I$7,Data!$B$4:$V$333,$A$8,FALSE)","v":580},{"$f":"VLOOKUP($C17&J$7,Data!$B$4:$V$333,$A$8,FALSE)","v":600},{"$f":"VLOOKUP($C17&K$7,Data!$B$4:$V$333,$A$8,FALSE)","v":570},{"$f":"VLOOKUP($C17&L$7,Data!$B$4:$V$333,$A$8,FALSE)","v":590},{"$f":"VLOOKUP($C17&M$7,Data!$B$4:$V$333,$A$8,FALSE)","v":580}]
[null,null,"East Renfrewshire",{"$f":"VLOOKUP($C18&D$7,Data!$B$4:$V$333,$A$8,FALSE)","v":530},{"$f":"VLOOKUP($C18&E$7,Data!$B$4:$V$333,$A$8,FALSE)","v":530},{"$f":"VLOOKUP($C18&F$7,Data!$B$4:$V$333,$A$8,FALSE)","v":520},{"$f":"VLOOKUP($C18&G$7,Data!$B$4:$V$333,$A$8,FALSE)","v":510},{"$f":"VLOOKUP($C18&H$7,Data!$B$4:$V$333,$A$8,FALSE)","v":510},{"$f":"VLOOKUP($C18&I$7,Data!$B$4:$V$333,$A$8,FALSE)","v":560},{"$f":"VLOOKUP($C18&J$7,Data!$B$4:$V$333,$A$8,FALSE)","v":570},{"$f":"VLOOKUP($C18&K$7,Data!$B$4:$V$333,$A$8,FALSE)","v":570},{"$f":"VLOOKUP($C18&L$7,Data!$B$4:$V$333,$A$8,FALSE)","v":580},{"$f":"VLOOKUP($C18&M$7,Data!$B$4:$V$333,$A$8,FALSE)","v":590}]
[null,null,"Edinburgh, City of",{"$f":"VLOOKUP($C19&D$7,Data!$B$4:$V$333,$A$8,FALSE)","v":{"v":2950,"d":"2,950"}},{"$f":"VLOOKUP($C19&E$7,Data!$B$4:$V$333,$A$8,FALSE)","v":{"v":2840,"d":"2,840"}},{"$f":"VLOOKUP($C19&F$7,Data!$B$4:$V$333,$A$8,FALSE)","v":{"v":2870,"d":"2,870"}},{"$f":"VLOOKUP($C19&G$7,Data!$B$4:$V$333,$A$8,FALSE)","v":{"v":2870,"d":"2,870"}},{"$f":"VLOOKUP($C19&H$7,Data!$B$4:$V$333,$A$8,FALSE)","v":{"v":2800,"d":"2,800"}},{"$f":"VLOOKUP($C19&I$7,Data!$B$4:$V$333,$A$8,FALSE)","v":{"v":2710,"d":"2,710"}},{"$f":"VLOOKUP($C19&J$7,Data!$B$4:$V$333,$A$8,FALSE)","v":{"v":2660,"d":"2,660"}},{"$f":"VLOOKUP($C19&K$7,Data!$B$4:$V$333,$A$8,FALSE)","v":{"v":2620,"d":"2,620"}},{"$f":"VLOOKUP($C19&L$7,Data!$B$4:$V$333,$A$8,FALSE)","v":{"v":2600,"d":"2,600"}},{"$f":"VLOOKUP($C19&M$7,Data!$B$4:$V$333,$A$8,FALSE)","v":{"v":2530,"d":"2,530"}}]
[null,null,"Eilean Siar",{"$f":"VLOOKUP($C20&D$7,Data!$B$4:$V$333,$A$8,FALSE)","v":190},{"$f":"VLOOKUP($C20&E$7,Data!$B$4:$V$333,$A$8,FALSE)","v":190},{"$f":"VLOOKUP($C20&F$7,Data!$B$4:$V$333,$A$8,FALSE)","v":190},{"$f":"VLOOKUP($C20&G$7,Data!$B$4:$V$333,$A$8,FALSE)","v":190},{"$f":"VLOOKUP($C20&H$7,Data!$B$4:$V$333,$A$8,FALSE)","v":190},{"$f":"VLOOKUP($C20&I$7,Data!$B$4:$V$333,$A$8,FALSE)","v":180},{"$f":"VLOOKUP($C20&J$7,Data!$B$4:$V$333,$A$8,FALSE)","v":180},{"$f":"VLOOKUP($C20&K$7,Data!$B$4:$V$333,$A$8,FALSE)","v":180},{"$f":"VLOOKUP($C20&L$7,Data!$B$4:$V$333,$A$8,FALSE)","v":190},{"$f":"VLOOKUP($C20&M$7,Data!$B$4:$V$333,$A$8,FALSE)","v":190}]
[null,null,"Falkirk",{"$f":"VLOOKUP($C21&D$7,Data!$B$4:$V$333,$A$8,FALSE)","v":740},{"$f":"VLOOKUP($C21&E$7,Data!$B$4:$V$333,$A$8,FALSE)","v":760},{"$f":"VLOOKUP($C21&F$7,Data!$B$4:$V$333,$A$8,FALSE)","v":760},{"$f":"VLOOKUP($C21&G$7,Data!$B$4:$V$333,$A$8,FALSE)","v":780},{"$f":"VLOOKUP($C21&H$7,Data!$B$4:$V$333,$A$8,FALSE)","v":800},{"$f":"VLOOKUP($C21&I$7,Data!$B$4:$V$333,$A$8,FALSE)","v":790},{"$f":"VLOOKUP($C21&J$7,Data!$B$4:$V$333,$A$8,FALSE)","v":850},{"$f":"VLOOKUP($C21&K$7,Data!$B$4:$V$333,$A$8,FALSE)","v":860},{"$f":"VLOOKUP($C21&L$7,Data!$B$4:$V$333,$A$8,FALSE)","v":890},{"$f":"VLOOKUP($C21&M$7,Data!$B$4:$V$333,$A$8,FALSE)","v":860}]
[null,null,"Fife",{"$f":"VLOOKUP($C22&D$7,Data!$B$4:$V$333,$A$8,FALSE)","v":{"v":2190,"d":"2,190"}},{"$f":"VLOOKUP($C22&E$7,Data!$B$4:$V$333,$A$8,FALSE)","v":{"v":2130,"d":"2,130"}},{"$f":"VLOOKUP($C22&F$7,Data!$B$4:$V$333,$A$8,FALSE)","v":{"v":2150,"d":"2,150"}},{"$f":"VLOOKUP($C22&G$7,Data!$B$4:$V$333,$A$8,FALSE)","v":{"v":2170,"d":"2,170"}},{"$f":"VLOOKUP($C22&H$7,Data!$B$4:$V$333,$A$8,FALSE)","v":{"v":2230,"d":"2,230"}},{"$f":"VLOOKUP($C22&I$7,Data!$B$4:$V$333,$A$8,FALSE)","v":{"v":2120,"d":"2,120"}},{"$f":"VLOOKUP($C22&J$7,Data!$B$4:$V$333,$A$8,FALSE)","v":{"v":2140,"d":"2,140"}},{"$f":"VLOOKUP($C22&K$7,Data!$B$4:$V$333,$A$8,FALSE)","v":{"v":2210,"d":"2,210"}},{"$f":"VLOOKUP($C22&L$7,Data!$B$4:$V$333,$A$8,FALSE)","v":{"v":2310,"d":"2,310"}},{"$f":"VLOOKUP($C22&M$7,Data!$B$4:$V$333,$A$8,FALSE)","v":{"v":2290,"d":"2,290"}}]
[null,null,"Glasgow City",{"$f":"VLOOKUP($C23&D$7,Data!$B$4:$V$333,$A$8,FALSE)","v":{"v":4430,"d":"4,430"}},{"$f":"VLOOKUP($C23&E$7,Data!$B$4:$V$333,$A$8,FALSE)","v":{"v":4300,"d":"4,300"}},{"$f":"VLOOKUP($C23&F$7,Data!$B$4:$V$333,$A$8,FALSE)","v":{"v":4180,"d":"4,180"}},{"$f":"VLOOKUP($C23&G$7,Data!$B$4:$V$333,$A$8,FALSE)","v":{"v":4000,"d":"4,000"}},{"$f":"VLOOKUP($C23&H$7,Data!$B$4:$V$333,$A$8,FALSE)","v":{"v":3960,"d":"3,960"}},{"$f":"VLOOKUP($C23&I$7,Data!$B$4:$V$333,$A$8,FALSE)","v":{"v":3900,"d":"3,900"}},{"$f":"VLOOKUP($C23&J$7,Data!$B$4:$V$333,$A$8,FALSE)","v":{"v":3800,"d":"3,800"}},{"$f":"VLOOKUP($C23&K$7,Data!$B$4:$V$333,$A$8,FALSE)","v":{"v":3570,"d":"3,570"}},{"$f":"VLOOKUP($C23&L$7,Data!$B$4:$V$333,$A$8,FALSE)","v":{"v":3600,"d":"3,600"}},{"$f":"VLOOKUP($C23&M$7,Data!$B$4:$V$333,$A$8,FALSE)","v":{"v":3330,"d":"3,330"}}]
[null,null,"Highland",{"$f":"VLOOKUP($C24&D$7,Data!$B$4:$V$333,$A$8,FALSE)","v":{"v":1440,"d":"1,440"}},{"$f":"VLOOKUP($C24&E$7,Data!$B$4:$V$333,$A$8,FALSE)","v":{"v":1450,"d":"1,450"}},{"$f":"VLOOKUP($C24&F$7,Data!$B$4:$V$333,$A$8,FALSE)","v":{"v":1510,"d":"1,510"}},{"$f":"VLOOKUP($C24&G$7,Data!$B$4:$V$333,$A$8,FALSE)","v":{"v":1510,"d":"1,510"}},{"$f":"VLOOKUP($C24&H$7,Data!$B$4:$V$333,$A$8,FALSE)","v":{"v":1500,"d":"1,500"}},{"$f":"VLOOKUP($C24&I$7,Data!$B$4:$V$333,$A$8,FALSE)","v":{"v":1470,"d":"1,470"}},{"$f":"VLOOKUP($C24&J$7,Data!$B$4:$V$333,$A$8,FALSE)","v":{"v":1490,"d":"1,490"}},{"$f":"VLOOKUP($C24&K$7,Data!$B$4:$V$333,$A$8,FALSE)","v":{"v":1560,"d":"1,560"}},{"$f":"VLOOKUP($C24&L$7,Data!$B$4:$V$333,$A$8,FALSE)","v":{"v":1570,"d":"1,570"}},{"$f":"VLOOKUP($C24&M$7,Data!$B$4:$V$333,$A$8,FALSE)","v":{"v":1580,"d":"1,580"}}]
[null,null,"Inverclyde",{"$f":"VLOOKUP($C25&D$7,Data!$B$4:$V$333,$A$8,FALSE)","v":580},{"$f":"VLOOKUP($C25&E$7,Data!$B$4:$V$333,$A$8,FALSE)","v":600},{"$f":"VLOOKUP($C25&F$7,Data!$B$4:$V$333,$A$8,FALSE)","v":560},{"$f":"VLOOKUP($C25&G$7,Data!$B$4:$V$333,$A$8,FALSE)","v":610},{"$f":"VLOOKUP($C25&H$7,Data!$B$4:$V$333,$A$8,FALSE)","v":600},{"$f":"VLOOKUP($C25&I$7,Data!$B$4:$V$333,$A$8,FALSE)","v":570},{"$f":"VLOOKUP($C25&J$7,Data!$B$4:$V$333,$A$8,FALSE)","v":600},{"$f":"VLOOKUP($C25&K$7,Data!$B$4:$V$333,$A$8,FALSE)","v":680},{"$f":"VLOOKUP($C25&L$7,Data!$B$4:$V$333,$A$8,FALSE)","v":620},{"$f":"VLOOKUP($C25&M$7,Data!$B$4:$V$333,$A$8,FALSE)","v":600}]
[null,null,"Midlothian",{"$f":"VLOOKUP($C26&D$7,Data!$B$4:$V$333,$A$8,FALSE)","v":490},{"$f":"VLOOKUP($C26&E$7,Data!$B$4:$V$333,$A$8,FALSE)","v":460},{"$f":"VLOOKUP($C26&F$7,Data!$B$4:$V$333,$A$8,FALSE)","v":440},{"$f":"VLOOKUP($C26&G$7,Data!$B$4:$V$333,$A$8,FALSE)","v":400},{"$f":"VLOOKUP($C26&H$7,Data!$B$4:$V$333,$A$8,FALSE)","v":390},{"$f":"VLOOKUP($C26&I$7,Data!$B$4:$V$333,$A$8,FALSE)","v":380},{"$f":"VLOOKUP($C26&J$7,Data!$B$4:$V$333,$A$8,FALSE)","v":380},{"$f":"VLOOKUP($C26&K$7,Data!$B$4:$V$333,$A$8,FALSE)","v":410},{"$f":"VLOOKUP($C26&L$7,Data!$B$4:$V$333,$A$8,FALSE)","v":380},{"$f":"VLOOKUP($C26&M$7,Data!$B$4:$V$333,$A$8,FALSE)","v":410}]
[null,null,"Moray",{"$f":"VLOOKUP($C27&D$7,Data!$B$4:$V$333,$A$8,FALSE)","v":480},{"$f":"VLOOKUP($C27&E$7,Data!$B$4:$V$333,$A$8,FALSE)","v":500},{"$f":"VLOOKUP($C27&F$7,Data!$B$4:$V$333,$A$8,FALSE)","v":510},{"$f":"VLOOKUP($C27&G$7,Data!$B$4:$V$333,$A$8,FALSE)","v":510},{"$f":"VLOOKUP($C27&H$7,Data!$B$4:$V$333,$A$8,FALSE)","v":510},{"$f":"VLOOKUP($C27&I$7,Data!$B$4:$V$333,$A$8,FALSE)","v":520},{"$f":"VLOOKUP($C27&J$7,Data!$B$4:$V$333,$A$8,FALSE)","v":540},{"$f":"VLOOKUP($C27&K$7,Data!$B$4:$V$333,$A$8,FALSE)","v":490},{"$f":"VLOOKUP($C27&L$7,Data!$B$4:$V$333,$A$8,FALSE)","v":470},{"$f":"VLOOKUP($C27&M$7,Data!$B$4:$V$333,$A$8,FALSE)","v":450}]
[null,null,"North Ayrshire",{"$f":"VLOOKUP($C28&D$7,Data!$B$4:$V$333,$A$8,FALSE)","v":800},{"$f":"VLOOKUP($C28&E$7,Data!$B$4:$V$333,$A$8,FALSE)","v":820},{"$f":"VLOOKUP($C28&F$7,Data!$B$4:$V$333,$A$8,FALSE)","v":830},{"$f":"VLOOKUP($C28&G$7,Data!$B$4:$V$333,$A$8,FALSE)","v":880},{"$f":"VLOOKUP($C28&H$7,Data!$B$4:$V$333,$A$8,FALSE)","v":900},{"$f":"VLOOKUP($C28&I$7,Data!$B$4:$V$333,$A$8,FALSE)","v":890},{"$f":"VLOOKUP($C28&J$7,Data!$B$4:$V$333,$A$8,FALSE)","v":910},{"$f":"VLOOKUP($C28&K$7,Data!$B$4:$V$333,$A$8,FALSE)","v":920},{"$f":"VLOOKUP($C28&L$7,Data!$B$4:$V$333,$A$8,FALSE)","v":880},{"$f":"VLOOKUP($C28&M$7,Data!$B$4:$V$333,$A$8,FALSE)","v":920}]
[null,null,"North Lanarkshire",{"$f":"VLOOKUP($C29&D$7,Data!$B$4:$V$333,$A$8,FALSE)","v":{"v":1450,"d":"1,450"}},{"$f":"VLOOKUP($C29&E$7,Data!$B$4:$V$333,$A$8,FALSE)","v":{"v":1450,"d":"1,450"}},{"$f":"VLOOKUP($C29&F$7,Data!$B$4:$V$333,$A$8,FALSE)","v":{"v":1430,"d":"1,430"}},{"$f":"VLOOKUP($C29&G$7,Data!$B$4:$V$333,$A$8,FALSE)","v":{"v":1400,"d":"1,400"}},{"$f":"VLOOKUP($C29&H$7,Data!$B$4:$V$333,$A$8,FALSE)","v":{"v":1360,"d":"1,360"}},{"$f":"VLOOKUP($C29&I$7,Data!$B$4:$V$333,$A$8,FALSE)","v":{"v":1320,"d":"1,320"}},{"$f":"VLOOKUP($C29&J$7,Data!$B$4:$V$333,$A$8,FALSE)","v":{"v":1360,"d":"1,360"}},{"$f":"VLOOKUP($C29&K$7,Data!$B$4:$V$333,$A$8,FALSE)","v":{"v":1290,"d":"1,290"}},{"$f":"VLOOKUP($C29&L$7,Data!$B$4:$V$333,$A$8,FALSE)","v":{"v":1290,"d":"1,290"}},{"$f":"VLOOKUP($C29&M$7,Data!$B$4:$V$333,$A$8,FALSE)","v":{"v":1280,"d":"1,280"}}]
[null,null,"Orkney Islands",{"$f":"VLOOKUP($C30&D$7,Data!$B$4:$V$333,$A$8,FALSE)","v":100},{"$f":"VLOOKUP($C30&E$7,Data!$B$4:$V$333,$A$8,FALSE)","v":110},{"$f":"VLOOKUP($C30&F$7,Data!$B$4:$V$333,$A$8,FALSE)","v":110},{"$f":"VLOOKUP($C30&G$7,Data!$B$4:$V$333,$A$8,FALSE)","v":100},{"$f":"VLOOKUP($C30&H$7,Data!$B$4:$V$333,$A$8,FALSE)","v":100},{"$f":"VLOOKUP($C30&I$7,Data!$B$4:$V$333,$A$8,FALSE)","v":100},{"$f":"VLOOKUP($C30&J$7,Data!$B$4:$V$333,$A$8,FALSE)","v":100},{"$f":"VLOOKUP($C30&K$7,Data!$B$4:$V$333,$A$8,FALSE)","v":100},{"$f":"VLOOKUP($C30&L$7,Data!$B$4:$V$333,$A$8,FALSE)","v":100},{"$f":"VLOOKUP($C30&M$7,Data!$B$4:$V$333,$A$8,FALSE)","v":90}]
[null,null,"Perth & Kinross",{"$f":"VLOOKUP($C31&D$7,Data!$B$4:$V$333,$A$8,FALSE)","v":{"v":1060,"d":"1,060"}},{"$f":"VLOOKUP($C31&E$7,Data!$B$4:$V$333,$A$8,FALSE)","v":{"v":1040,"d":"1,040"}},{"$f":"VLOOKUP($C31&F$7,Data!$B$4:$V$333,$A$8,FALSE)","v":990},{"$f":"VLOOKUP($C31&G$7,Data!$B$4:$V$333,$A$8,FALSE)","v":850},{"$f":"VLOOKUP($C31&H$7,Data!$B$4:$V$333,$A$8,FALSE)","v":820},{"$f":"VLOOKUP($C31&I$7,Data!$B$4:$V$333,$A$8,FALSE)","v":940},{"$f":"VLOOKUP($C31&J$7,Data!$B$4:$V$333,$A$8,FALSE)","v":960},{"$f":"VLOOKUP($C31&K$7,Data!$B$4:$V$333,$A$8,FALSE)","v":940},{"$f":"VLOOKUP($C31&L$7,Data!$B$4:$V$333,$A$8,FALSE)","v":960},{"$f":"VLOOKUP($C31&M$7,Data!$B$4:$V$333,$A$8,FALSE)","v":{"v":1000,"d":"1,000"}}]
[null,null,"Renfrewshire",{"$f":"VLOOKUP($C32&D$7,Data!$B$4:$V$333,$A$8,FALSE)","v":{"v":1060,"d":"1,060"}},{"$f":"VLOOKUP($C32&E$7,Data!$B$4:$V$333,$A$8,FALSE)","v":{"v":1030,"d":"1,030"}},{"$f":"VLOOKUP($C32&F$7,Data!$B$4:$V$333,$A$8,FALSE)","v":{"v":1030,"d":"1,030"}},{"$f":"VLOOKUP($C32&G$7,Data!$B$4:$V$333,$A$8,FALSE)","v":{"v":1020,"d":"1,020"}},{"$f":"VLOOKUP($C32&H$7,Data!$B$4:$V$333,$A$8,FALSE)","v":{"v":1080,"d":"1,080"}},{"$f":"VLOOKUP($C32&I$7,Data!$B$4:$V$333,$A$8,FALSE)","v":{"v":1040,"d":"1,040"}},{"$f":"VLOOKUP($C32&J$7,Data!$B$4:$V$333,$A$8,FALSE)","v":{"v":1040,"d":"1,040"}},{"$f":"VLOOKUP($C32&K$7,Data!$B$4:$V$333,$A$8,FALSE)","v":990},{"$f":"VLOOKUP($C32&L$7,Data!$B$4:$V$333,$A$8,FALSE)","v":{"v":1010,"d":"1,010"}},{"$f":"VLOOKUP($C32&M$7,Data!$B$4:$V$333,$A$8,FALSE)","v":990}]
[null,null,"Scottish Borders",{"$f":"VLOOKUP($C33&D$7,Data!$B$4:$V$333,$A$8,FALSE)","v":720},{"$f":"VLOOKUP($C33&E$7,Data!$B$4:$V$333,$A$8,FALSE)","v":720},{"$f":"VLOOKUP($C33&F$7,Data!$B$4:$V$333,$A$8,FALSE)","v":700},{"$f":"VLOOKUP($C33&G$7,Data!$B$4:$V$333,$A$8,FALSE)","v":700},{"$f":"VLOOKUP($C33&H$7,Data!$B$4:$V$333,$A$8,FALSE)","v":680},{"$f":"VLOOKUP($C33&I$7,Data!$B$4:$V$333,$A$8,FALSE)","v":620},{"$f":"VLOOKUP($C33&J$7,Data!$B$4:$V$333,$A$8,FALSE)","v":660},{"$f":"VLOOKUP($C33&K$7,Data!$B$4:$V$333,$A$8,FALSE)","v":650},{"$f":"VLOOKUP($C33&L$7,Data!$B$4:$V$333,$A$8,FALSE)","v":670},{"$f":"VLOOKUP($C33&M$7,Data!$B$4:$V$333,$A$8,FALSE)","v":680}]
[null,null,"Shetland Islands",{"$f":"VLOOKUP($C34&D$7,Data!$B$4:$V$333,$A$8,FALSE)","v":110},{"$f":"VLOOKUP($C34&E$7,Data!$B$4:$V$333,$A$8,FALSE)","v":110},{"$f":"VLOOKUP($C34&F$7,Data!$B$4:$V$333,$A$8,FALSE)","v":110},{"$f":"VLOOKUP($C34&G$7,Data!$B$4:$V$333,$A$8,FALSE)","v":110},{"$f":"VLOOKUP($C34&H$7,Data!$B$4:$V$333,$A$8,FALSE)","v":100},{"$f":"VLOOKUP($C34&I$7,Data!$B$4:$V$333,$A$8,FALSE)","v":90},{"$f":"VLOOKUP($C34&J$7,Data!$B$4:$V$333,$A$8,FALSE)","v":90},{"$f":"VLOOKUP($C34&K$7,Data!$B$4:$V$333,$A$8,FALSE)","v":100},{"$f":"VLOOKUP($C34&L$7,Data!$B$4:$V$333,$A$8,FALSE)","v":80},{"$f":"VLOOKUP($C34&M$7,Data!$B$4:$V$333,$A$8,FALSE)","v":70}]
[null,null,"South Ayrshire",{"$f":"VLOOKUP($C35&D$7,Data!$B$4:$V$333,$A$8,FALSE)","v":810},{"$f":"VLOOKUP($C35&E$7,Data!$B$4:$V$333,$A$8,FALSE)","v":810},{"$f":"VLOOKUP($C35&F$7,Data!$B$4:$V$333,$A$8,FALSE)","v":820},{"$f":"VLOOKUP($C35&G$7,Data!$B$4:$V$333,$A$8,FALSE)","v":840},{"$f":"VLOOKUP($C35&H$7,Data!$B$4:$V$333,$A$8,FALSE)","v":850},{"$f":"VLOOKUP($C35&I$7,Data!$B$4:$V$333,$A$8,FALSE)","v":850},{"$f":"VLOOKUP($C35&J$7,Data!$B$4:$V$333,$A$8,FALSE)","v":840},{"$f":"VLOOKUP($C35&K$7,Data!$B$4:$V$333,$A$8,FALSE)","v":900},{"$f":"VLOOKUP($C35&L$7,Data!$B$4:$V$333,$A$8,FALSE)","v":850},{"$f":"VLOOKUP($C35&M$7,Data!$B$4:$V$333,$A$8,FALSE)","v":910}]
[null,null,"South Lanarkshire",{"$f":"VLOOKUP($C36&D$7,Data!$B$4:$V$333,$A$8,FALSE)","v":{"v":1680,"d":"1,680"}},{"$f":"VLOOKUP($C36&E$7,Data!$B$4:$V$333,$A$8,FALSE)","v":{"v":1720,"d":"1,720"}},{"$f":"VLOOKUP($C36&F$7,Data!$B$4:$V$333,$A$8,FALSE)","v":{"v":1760,"d":"1,760"}},{"$f":"VLOOKUP($C36&G$7,Data!$B$4:$V$333,$A$8,FALSE)","v":{"v":1710,"d":"1,710"}},{"$f":"VLOOKUP($C36&H$7,Data!$B$4:$V$333,$A$8,FALSE)","v":{"v":1730,"d":"1,730"}},{"$f":"VLOOKUP($C36&I$7,Data!$B$4:$V$333,$A$8,FALSE)","v":{"v":1680,"d":"1,680"}},{"$f":"VLOOKUP($C36&J$7,Data!$B$4:$V$333,$A$8,FALSE)","v":{"v":1680,"d":"1,680"}},{"$f":"VLOOKUP($C36&K$7,Data!$B$4:$V$333,$A$8,FALSE)","v":{"v":1690,"d":"1,690"}},{"$f":"VLOOKUP($C36&L$7,Data!$B$4:$V$333,$A$8,FALSE)","v":{"v":1800,"d":"1,800"}},{"$f":"VLOOKUP($C36&M$7,Data!$B$4:$V$333,$A$8,FALSE)","v":{"v":1780,"d":"1,780"}}]
[null,null,"Stirling",{"$f":"VLOOKUP($C37&D$7,Data!$B$4:$V$333,$A$8,FALSE)","v":520},{"$f":"VLOOKUP($C37&E$7,Data!$B$4:$V$333,$A$8,FALSE)","v":520},{"$f":"VLOOKUP($C37&F$7,Data!$B$4:$V$333,$A$8,FALSE)","v":520},{"$f":"VLOOKUP($C37&G$7,Data!$B$4:$V$333,$A$8,FALSE)","v":470},{"$f":"VLOOKUP($C37&H$7,Data!$B$4:$V$333,$A$8,FALSE)","v":460},{"$f":"VLOOKUP($C37&I$7,Data!$B$4:$V$333,$A$8,FALSE)","v":450},{"$f":"VLOOKUP($C37&J$7,Data!$B$4:$V$333,$A$8,FALSE)","v":460},{"$f":"VLOOKUP($C37&K$7,Data!$B$4:$V$333,$A$8,FALSE)","v":440},{"$f":"VLOOKUP($C37&L$7,Data!$B$4:$V$333,$A$8,FALSE)","v":440},{"$f":"VLOOKUP($C37&M$7,Data!$B$4:$V$333,$A$8,FALSE)","v":480}]
[null,null,"West Dunbartonshire",{"$f":"VLOOKUP($C38&D$7,Data!$B$4:$V$333,$A$8,FALSE)","v":510},{"$f":"VLOOKUP($C38&E$7,Data!$B$4:$V$333,$A$8,FALSE)","v":510},{"$f":"VLOOKUP($C38&F$7,Data!$B$4:$V$333,$A$8,FALSE)","v":480},{"$f":"VLOOKUP($C38&G$7,Data!$B$4:$V$333,$A$8,FALSE)","v":480},{"$f":"VLOOKUP($C38&H$7,Data!$B$4:$V$333,$A$8,FALSE)","v":510},{"$f":"VLOOKUP($C38&I$7,Data!$B$4:$V$333,$A$8,FALSE)","v":530},{"$f":"VLOOKUP($C38&J$7,Data!$B$4:$V$333,$A$8,FALSE)","v":560},{"$f":"VLOOKUP($C38&K$7,Data!$B$4:$V$333,$A$8,FALSE)","v":540},{"$f":"VLOOKUP($C38&L$7,Data!$B$4:$V$333,$A$8,FALSE)","v":540},{"$f":"VLOOKUP($C38&M$7,Data!$B$4:$V$333,$A$8,FALSE)","v":550}]
[null,null,"West Lothian",{"$f":"VLOOKUP($C39&D$7,Data!$B$4:$V$333,$A$8,FALSE)","v":630},{"$f":"VLOOKUP($C39&E$7,Data!$B$4:$V$333,$A$8,FALSE)","v":650},{"$f":"VLOOKUP($C39&F$7,Data!$B$4:$V$333,$A$8,FALSE)","v":620},{"$f":"VLOOKUP($C39&G$7,Data!$B$4:$V$333,$A$8,FALSE)","v":620},{"$f":"VLOOKUP($C39&H$7,Data!$B$4:$V$333,$A$8,FALSE)","v":670},{"$f":"VLOOKUP($C39&I$7,Data!$B$4:$V$333,$A$8,FALSE)","v":690},{"$f":"VLOOKUP($C39&J$7,Data!$B$4:$V$333,$A$8,FALSE)","v":690},{"$f":"VLOOKUP($C39&K$7,Data!$B$4:$V$333,$A$8,FALSE)","v":680},{"$f":"VLOOKUP($C39&L$7,Data!$B$4:$V$333,$A$8,FALSE)","v":700},{"$f":"VLOOKUP($C39&M$7,Data!$B$4:$V$333,$A$8,FALSE)","v":730}]
[null,null,"Scotland",{"$f":"VLOOKUP($C40&D$7,Data!$B$4:$V$333,$A$8,FALSE)","v":{"v":31730,"d":"31,730"}},{"$f":"VLOOKUP($C40&E$7,Data!$B$4:$V$333,$A$8,FALSE)","v":{"v":31530,"d":"31,530"}},{"$f":"VLOOKUP($C40&F$7,Data!$B$4:$V$333,$A$8,FALSE)","v":{"v":31470,"d":"31,470"}},{"$f":"VLOOKUP($C40&G$7,Data!$B$4:$V$333,$A$8,FALSE)","v":{"v":31020,"d":"31,020"}},{"$f":"VLOOKUP($C40&H$7,Data!$B$4:$V$333,$A$8,FALSE)","v":{"v":30750,"d":"30,750"}},{"$f":"VLOOKUP($C40&I$7,Data!$B$4:$V$333,$A$8,FALSE)","v":{"v":30260,"d":"30,260"}},{"$f":"VLOOKUP($C40&J$7,Data!$B$4:$V$333,$A$8,FALSE)","v":{"v":30800,"d":"30,800"}},{"$f":"VLOOKUP($C40&K$7,Data!$B$4:$V$333,$A$8,FALSE)","v":{"v":30520,"d":"30,520"}},{"$f":"VLOOKUP($C40&L$7,Data!$B$4:$V$333,$A$8,FALSE)","v":{"v":30800,"d":"30,800"}},{"$f":"VLOOKUP($C40&M$7,Data!$B$4:$V$333,$A$8,FALSE)","v":{"v":30670,"d":"30,670"}}]
[]
[null,null,"Source: Community Care Quarterly Key Monitoring Return (Client data), FPNC survey and LFR3 (Expenditure data)"]
[null,null,{"$f":"IF($A$6=\"Clients\",\"FNPC figures are yearly averages rounded to the nearest 10.\",IF($A$6=\"Expenditure (Inc Overheads)\",\"FPC figures are in £thousands. Overheads included in all FPNC figures\",\"FPC figures are in £thousands. Overheads excluded from all FPNC figures\"))","v":"FNPC figures are yearly averages rounded to the nearest 10."}]
[null,null,"The system used to report the number of clients in care homes in Dumfries & Galloway has recently been updated to properly reflect the number of self-funders in receipt of free personal and nursing care. This means that client numbers for Dumfries & Galloway in 2016/17 are not strictly comparable with previous years."]

{"sheet":"Table4","index":7,"n_rows":20,"n_cols":39,"rows_kept":20}
[null,{"$f":"IF($A$6=\"Clients\",(\"Number of clients receiving FPC at home in \"& A5&\", 2007-08 to 2016-17\"),(\"Expenditure on FPC provide at home in \"& A5&\", 2007-08 to 2016-17\"))","v":"Number of clients receiving FPC at home in Scotland, 2007-08 to 2016-17"},{"$nulls":10},"Main page"]
[]
[null,null,"Select Local Authority:",null,null,"Select client or expenditure data:",{"$nulls":6},"Background notes"]
[]
["Scotland"," "]
["Clients"," ",{"$nulls":6},{"$f":"IF(A6=\"Expenditure\",\"£000's\",\"\")","v":""},{"$nulls":20},"07-08","08-09","09-10","10-11","11-12","12-13","13-14","14-15","15-16","16-17"]
[{"$nulls":3},"2007-08","2008-09","2009-10","2010-11","2011-12","2012-13","2013-14","2014-15","2015-16","2016-17",{"$nulls":16},"2007-08","2008-09","2009-10","2010-11","2011-12","2012-13","2013-14","2014-15","2015-16","2016-17"]
[{"$f":"IF($A$6=\"Clients\",8,15)","v":8},null,{"$f":"IF($A$6=\"Clients\",\"Number of Home Care Clients aged 65+\",\"Net expenditure on Home Care for older people\")","v":"Number of Home Care Clients aged 65+"},{"$f":"VLOOKUP($A$5&D$7,Data!$B$4:$V$333,$A8,FALSE)","v":{"v":55340,"d":"55,340"}},{"$f":"VLOOKUP($A$5&E$7,Data!$B$4:$V$333,$A8,FALSE)","v":{"v":54720,"d":"54,720"}},{"$f":"VLOOKUP($A$5&F$7,Data!$B$4:$V$333,$A8,FALSE)","v":{"v":53660,"d":"53,660"}},{"$f":"VLOOKUP($A$5&G$7,Data!$B$4:$V$333,$A8,FALSE)","v":{"v":51730,"d":"51,730"}},{"$f":"VLOOKUP($A$5&H$7,Data!$B$4:$V$333,$A8,FALSE)","v":{"v":51120,"d":"51,120"}},{"$f":"VLOOKUP($A$5&I$7,Data!$B$4:$V$333,$A8,FALSE)","v":{"v":50370,"d":"50,370"}},{"$f":"VLOOKUP($A$5&J$7,Data!$B$4:$V$333,$A8,FALSE)","v":{"v":50450,"d":"50,450"}},{"$f":"VLOOKUP($A$5&K$7,Data!$B$4:$V$333,$A8,FALSE)","v":{"v":50160,"d":"50,160"}},{"$f":"VLOOKUP($A$5&L$7,Data!$B$4:$V$333,$A8,FALSE)","v":{"v":49430,"d":"49,430"}},{"$f":"VLOOKUP($A$5&M$7,Data!$B$4:$V$333,$A8,FALSE)","v":{"v":48810,"d":"48,810"}},{"$nulls":15},{"$f":"C8","v":"Number of Home Care Clients aged 65+"},{"$f":"D8","v":55340},54720,53660,51730,51120,50370,50450,50160,49430,48810]
[{"$f":"IF($A$6=\"Clients\",9,IF($A$6=\"Expenditure (£thousands - including overheads)\",16,20))","v":9},null,{"$f":"IF($A$6=\"Clients\",\"Number of clients aged 65+ receiving FPC at home\",IF($A$6=\"Expenditure (Inc Overheads)\",\"Expenditure (Including Overheads) on FPC at home\",\"Expenditure (Excluding Overheads) on FPC at home\"))","v":"Number of clients aged 65+ receiving FPC at home"},{"$f":"VLOOKUP($A$5&D$7,Data!$B$4:$V$333,$A9,FALSE)","v":{"v":42260,"d":"42,260"}},{"$f":"VLOOKUP($A$5&E$7,Data!$B$4:$V$333,$A9,FALSE)","v":{"v":44200,"d":"44,200"}},{"$f":"VLOOKUP($A$5&F$7,Data!$B$4:$V$333,$A9,FALSE)","v":{"v":46660,"d":"46,660"}},{"$f":"VLOOKUP($A$5&G$7,Data!$B$4:$V$333,$A9,FALSE)","v":{"v":46950,"d":"46,950"}},{"$f":"VLOOKUP($A$5&H$7,Data!$B$4:$V$333,$A9,FALSE)","v":{"v":47010,"d":"47,010"}},{"$f":"VLOOKUP($A$5&I$7,Data!$B$4:$V$333,$A9,FALSE)","v":{"v":47170,"d":"47,170"}},{"$f":"VLOOKUP($A$5&J$7,Data!$B$4:$V$333,$A9,FALSE)","v":{"v":47810,"d":"47,810"}},{"$f":"VLOOKUP($A$5&K$7,Data!$B$4:$V$333,$A9,FALSE)","v":{"v":46750,"d":"46,750"}},{"$f":"VLOOKUP($A$5&L$7,Data!$B$4:$V$333,$A9,FALSE)","v":{"v":46910,"d":"46,910"}},{"$f":"VLOOKUP($A$5&M$7,Data!$B$4:$V$333,$A9,FALSE)","v":{"v":45780,"d":"45,780"}},{"$nulls":15},{"$f":"C9","v":"Number of clients aged 65+ receiving FPC at home"},{"$f":"D9","v":42260},44200,46660,46950,47010,47170,47810,46750,46910,45780]
[null,null,"Percentage receiving FPC",{"$f":"D9/D8","v":{"v":0.7636429345861945,"d":"76%"}},{"$f":"E9/E8","v":{"v":0.8077485380116959,"d":"81%"}},{"$f":"F9/F8","v":{"v":0.8695490122996645,"d":"87%"}},{"$f":"G9/G8","v":{"v":0.9075971389909143,"d":"91%"}},{"v":0.9196009389671361,"d":"92%"},{"v":0.9364701211038317,"d":"94%"},{"v":0.9476709613478692,"d":"95%"},{"v":0.9320175438596491,"d":"93%"},{"v":0.9490188144851305,"d":"95%"},{"v":0.9379225568531039,"d":"94%"},{"$nulls":15},{"$f":"C10","v":"Percentage receiving FPC"},{"v":0.7636429345861945,"d":"76.36%"},{"v":0.8077485380116959,"d":"80.77%"},{"v":0.8695490122996645,"d":"86.95%"},{"v":0.9075971389909143,"d":"90.76%"},{"v":0.9196009389671361,"d":"91.96%"},{"v":0.9364701211038317,"d":"93.65%"},{"v":0.9476709613478692,"d":"94.77%"},{"v":0.9320175438596491,"d":"93.20%"},{"v":0.9490188144851305,"d":"94.90%"},{"v":0.9379225568531039,"d":"93.79%"}]
[]
[10,null,"Average weekly hours of FPC at home",{"$f":"VLOOKUP($A$5&D$7,Data!$B$4:$V$333,$A12,FALSE)","v":{"v":299400,"d":"299,400"}},{"$f":"VLOOKUP($A$5&E$7,Data!$B$4:$V$333,$A12,FALSE)","v":{"v":333100,"d":"333,100"}},{"$f":"VLOOKUP($A$5&F$7,Data!$B$4:$V$333,$A12,FALSE)","v":{"v":361700,"d":"361,700"}},{"$f":"VLOOKUP($A$5&G$7,Data!$B$4:$V$333,$A12,FALSE)","v":{"v":371900,"d":"371,900"}},{"$f":"VLOOKUP($A$5&H$7,Data!$B$4:$V$333,$A12,FALSE)","v":{"v":389000,"d":"389,000"}},{"$f":"VLOOKUP($A$5&I$7,Data!$B$4:$V$333,$A12,FALSE)","v":{"v":400500,"d":"400,500"}},{"$f":"VLOOKUP($A$5&J$7,Data!$B$4:$V$333,$A12,FALSE)","v":{"v":409500,"d":"409,500"}},{"$f":"VLOOKUP($A$5&K$7,Data!$B$4:$V$333,$A12,FALSE)","v":{"v":401600,"d":"401,600"}},{"$f":"VLOOKUP($A$5&L$7,Data!$B$4:$V$333,$A12,FALSE)","v":{"v":405400,"d":"405,400"}},{"$f":"VLOOKUP($A$5&M$7,Data!$B$4:$V$333,$A12,FALSE)","v":{"v":405000,"d":"405,000"}},{"$nulls":15},{"$f":"C12","v":"Average weekly hours of FPC at home"},299400,333100,361700,371900,389000,400500,409500,401600,405400,405000]
[]
[null,null,"Source: Community Care Quarterly Key Monitoring Return (Client data), Social Care Survey 2013 onwards, FPNC survey and LFR3 (Expenditure data), NRS mid-year estimates (population data)"]
[null,null,{"$f":"IF($A$6=\"Clients\",\"FNPC figures are yearly averages rounded to the nearest 10.\",IF($A$6=\"Expenditure (Inc Overheads)\",\"Expenditure figures are in £thousands. Overheads are included in all FPNC figures\",\"FPC figures are in £thousands. Overheads are excluded from all FPNC figures\"))","v":"FNPC figures are yearly averages rounded to the nearest 10."}]
[null,null,"Average weekly hours (based on last week of each quarter) rounded to the nearest 100."]
[]
[]
[]
[null,null,{"$f":"IF($A$6=\"Clients\",\"Chart 1 - Number of clients receiving FPC\",IF($A$6=\"Expenditure (£thousands - including overheads)\",\"Chart 1 - FPC Expenditure (including overheads)\",\"Chart 1 - FPC Expenditure (excluding overheads)\"))","v":"Chart 1 - Number of clients receiving FPC"},{"$nulls":3},{"$f":"IF($A$6=\"Clients\",\"Chart 2 - Percentage of home care clients receiving FPC\",\"Chart 2 - Percentage of home care expenditure on FPC\")","v":"Chart 2 - Percentage of home care clients receiving FPC"}]

{"sheet":"Table5","index":8,"n_rows":44,"n_cols":13,"rows_kept":44}
[null,{"$f":"IF(A6=\"Clients\",(\"Number of \"&A5&\", 2007-08 to 2016-17\"),(\"Expenditure on \"&A5&\", 2007-08 to 2016-17\"))","v":"Number of Clients aged 65+ receiving FPC at home, 2007-08 to 2016-17"},{"$nulls":10},"Main page"]
[]
[null,null,"Select required data type:",{"$nulls":4},"Select client or expenditure data:",{"$nulls":4},"Background notes"]
[]
["Clients aged 65+ receiving FPC at home"," "]
["Clients"," "]
[{"$f":"IF(A6=\"Clients\",2,IF($A$6=\"Expenditure (£thousands - including overheads)\",3,4))","v":2},null,"Local Authority","2007-08","2008-09","2009-10","2010-11","2011-12","2012-13","2013-14","2014-15","2015-16","2016-17"]
[{"$f":"VLOOKUP(A5,Lookups!H8:K10,A7,FALSE)","v":9},null,"Aberdeen City",{"$f":"IF($A$11=1,\"NA\",VLOOKUP($C8&D$7,Data!$B$4:$V$333,$A$8,FALSE))","v":{"v":1810,"d":"1,810"}},{"$f":"IF($A$11=1,\"NA\",VLOOKUP($C8&E$7,Data!$B$4:$V$333,$A$8,FALSE))","v":{"v":1620,"d":"1,620"}},{"$f":"IF($A$11=1,\"NA\",VLOOKUP($C8&F$7,Data!$B$4:$V$333,$A$8,FALSE))","v":{"v":1710,"d":"1,710"}},{"$f":"IF($A$11=1,\"NA\",VLOOKUP($C8&G$7,Data!$B$4:$V$333,$A$8,FALSE))","v":{"v":1740,"d":"1,740"}},{"$f":"IF($A$11=1,\"NA\",VLOOKUP($C8&H$7,Data!$B$4:$V$333,$A$8,FALSE))","v":{"v":1780,"d":"1,780"}},{"$f":"IF($A$11=1,\"NA\",VLOOKUP($C8&I$7,Data!$B$4:$V$333,$A$8,FALSE))","v":{"v":1610,"d":"1,610"}},{"$f":"IF($A$11=1,\"NA\",VLOOKUP($C8&J$7,Data!$B$4:$V$333,$A$8,FALSE))","v":{"v":1560,"d":"1,560"}},{"$f":"IF($A$11=1,\"NA\",VLOOKUP($C8&K$7,Data!$B$4:$V$333,$A$8,FALSE))","v":{"v":1490,"d":"1,490"}},{"$f":"IF($A$11=1,\"NA\",VLOOKUP($C8&L$7,Data!$B$4:$V$333,$A$8,FALSE))","v":{"v":1560,"d":"1,560"}},{"$f":"IF($A$11=1,\"NA\",VLOOKUP($C8&M$7,Data!$B$4:$V$333,$A$8,FALSE))","v":{"v":1500,"d":"1,500"}}]
[null,null,"Aberdeenshire",{"$f":"IF($A$11=1,\"NA\",VLOOKUP($C9&D$7,Data!$B$4:$V$333,$A$8,FALSE))","v":{"v":1920,"d":"1,920"}},{"$f":"IF($A$11=1,\"NA\",VLOOKUP($C9&E$7,Data!$B$4:$V$333,$A$8,FALSE))","v":{"v":2000,"d":"2,000"}},{"$f":"IF($A$11=1,\"NA\",VLOOKUP($C9&F$7,Data!$B$4:$V$333,$A$8,FALSE))","v":{"v":1810,"d":"1,810"}},{"$f":"IF($A$11=1,\"NA\",VLOOKUP($C9&G$7,Data!$B$4:$V$333,$A$8,FALSE))","v":{"v":1790,"d":"1,790"}},{"$f":"IF($A$11=1,\"NA\",VLOOKUP($C9&H$7,Data!$B$4:$V$333,$A$8,FALSE))","v":{"v":1660,"d":"1,660"}},{"$f":"IF($A$11=1,\"NA\",VLOOKUP($C9&I$7,Data!$B$4:$V$333,$A$8,FALSE))","v":{"v":1740,"d":"1,740"}},{"$f":"IF($A$11=1,\"NA\",VLOOKUP($C9&J$7,Data!$B$4:$V$333,$A$8,FALSE))","v":{"v":1810,"d":"1,810"}},{"$f":"IF($A$11=1,\"NA\",VLOOKUP($C9&K$7,Data!$B$4:$V$333,$A$8,FALSE))","v":{"v":1770,"d":"1,770"}},{"$f":"IF($A$11=1,\"NA\",VLOOKUP($C9&L$7,Data!$B$4:$V$333,$A$8,FALSE))","v":{"v":1830,"d":"1,830"}},{"$f":"IF($A$11=1,\"NA\",VLOOKUP($C9&M$7,Data!$B$4:$V$333,$A$8,FALSE))","v":{"v":1960,"d":"1,960"}}]
[null,null,"Angus",{"$f":"IF($A$11=1,\"NA\",VLOOKUP($C10&D$7,Data!$B$4:$V$333,$A$8,FALSE))","v":810},{"$f":"IF($A$11=1,\"NA\",VLOOKUP($C10&E$7,Data!$B$4:$V$333,$A$8,FALSE))","v":820},{"$f":"IF($A$11=1,\"NA\",VLOOKUP($C10&F$7,Data!$B$4:$V$333,$A$8,FALSE))","v":870},{"$f":"IF($A$11=1,\"NA\",VLOOKUP($C10&G$7,Data!$B$4:$V$333,$A$8,FALSE))","v":860},{"$f":"IF($A$11=1,\"NA\",VLOOKUP($C10&H$7,Data!$B$4:$V$333,$A$8,FALSE))","v":800},{"$f":"IF($A$11=1,\"NA\",VLOOKUP($C10&I$7,Data!$B$4:$V$333,$A$8,FALSE))","v":730},{"$f":"IF($A$11=1,\"NA\",VLOOKUP($C10&J$7,Data!$B$4:$V$333,$A$8,FALSE))","v":{"v":1140,"d":"1,140"}},{"$f":"IF($A$11=1,\"NA\",VLOOKUP($C10&K$7,Data!$B$4:$V$333,$A$8,FALSE))","v":680},{"$f":"IF($A$11=1,\"NA\",VLOOKUP($C10&L$7,Data!$B$4:$V$333,$A$8,FALSE))","v":670},{"$f":"IF($A$11=1,\"NA\",VLOOKUP($C10&M$7,Data!$B$4:$V$333,$A$8,FALSE))","v":730}]
[{"$f":"IF((SUM(A12:A13))=2,1,\"\")","v":""},null,"Argyll & Bute",{"$f":"IF($A$11=1,\"NA\",VLOOKUP($C11&D$7,Data!$B$4:$V$333,$A$8,FALSE))","v":560},{"$f":"IF($A$11=1,\"NA\",VLOOKUP($C11&E$7,Data!$B$4:$V$333,$A$8,FALSE))","v":640},{"$f":"IF($A$11=1,\"NA\",VLOOKUP($C11&F$7,Data!$B$4:$V$333,$A$8,FALSE))","v":720},{"$f":"IF($A$11=1,\"NA\",VLOOKUP($C11&G$7,Data!$B$4:$V$333,$A$8,FALSE))","v":750},{"$f":"IF($A$11=1,\"NA\",VLOOKUP($C11&H$7,Data!$B$4:$V$333,$A$8,FALSE))","v":830},{"$f":"IF($A$11=1,\"NA\",VLOOKUP($C11&I$7,Data!$B$4:$V$333,$A$8,FALSE))","v":920},{"$f":"IF($A$11=1,\"NA\",VLOOKUP($C11&J$7,Data!$B$4:$V$333,$A$8,FALSE))","v":{"v":1080,"d":"1,080"}},{"$f":"IF($A$11=1,\"NA\",VLOOKUP($C11&K$7,Data!$B$4:$V$333,$A$8,FALSE))","v":{"v":1100,"d":"1,100"}},{"$f":"IF($A$11=1,\"NA\",VLOOKUP($C11&L$7,Data!$B$4:$V$333,$A$8,FALSE))","v":{"v":1020,"d":"1,020"}},{"$f":"IF($A$11=1,\"NA\",VLOOKUP($C11&M$7,Data!$B$4:$V$333,$A$8,FALSE))","v":{"v":1010,"d":"1,010"}}]
[{"$f":"IF(A5=\"Average weekly hours of FPC at home\",1,0)","v":0},null,"Clackmannanshire",{"$f":"IF($A$11=1,\"NA\",VLOOKUP($C12&D$7,Data!$B$4:$V$333,$A$8,FALSE))","v":500},{"$f":"IF($A$11=1,\"NA\",VLOOKUP($C12&E$7,Data!$B$4:$V$333,$A$8,FALSE))","v":510},{"$f":"IF($A$11=1,\"NA\",VLOOKUP($C12&F$7,Data!$B$4:$V$333,$A$8,FALSE))","v":490},{"$f":"IF($A$11=1,\"NA\",VLOOKUP($C12&G$7,Data!$B$4:$V$333,$A$8,FALSE))","v":530},{"$f":"IF($A$11=1,\"NA\",VLOOKUP($C12&H$7,Data!$B$4:$V$333,$A$8,FALSE))","v":530},{"$f":"IF($A$11=1,\"NA\",VLOOKUP($C12&I$7,Data!$B$4:$V$333,$A$8,FALSE))","v":550},{"$f":"IF($A$11=1,\"NA\",VLOOKUP($C12&J$7,Data!$B$4:$V$333,$A$8,FALSE))","v":530},{"$f":"IF($A$11=1,\"NA\",VLOOKUP($C12&K$7,Data!$B$4:$V$333,$A$8,FALSE))","v":470},{"$f":"IF($A$11=1,\"NA\",VLOOKUP($C12&L$7,Data!$B$4:$V$333,$A$8,FALSE))","v":520},{"$f":"IF($A$11=1,\"NA\",VLOOKUP($C12&M$7,Data!$B$4:$V$333,$A$8,FALSE))","v":500}]
[{"$f":"IF(A6=\"Clients\",0,1)","v":0},null,"Dumfries & Galloway",{"$f":"IF($A$11=1,\"NA\",VLOOKUP($C13&D$7,Data!$B$4:$V$333,$A$8,FALSE))","v":{"v":1500,"d":"1,500"}},{"$f":"IF($A$11=1,\"NA\",VLOOKUP($C13&E$7,Data!$B$4:$V$333,$A$8,FALSE))","v":{"v":1730,"d":"1,730"}},{"$f":"IF($A$11=1,\"NA\",VLOOKUP($C13&F$7,Data!$B$4:$V$333,$A$8,FALSE))","v":{"v":1870,"d":"1,870"}},{"$f":"IF($A$11=1,\"NA\",VLOOKUP($C13&G$7,Data!$B$4:$V$333,$A$8,FALSE))","v":{"v":1860,"d":"1,860"}},{"$f":"IF($A$11=1,\"NA\",VLOOKUP($C13&H$7,Data!$B$4:$V$333,$A$8,FALSE))","v":{"v":1980,"d":"1,980"}},{"$f":"IF($A$11=1,\"NA\",VLOOKUP($C13&I$7,Data!$B$4:$V$333,$A$8,FALSE))","v":{"v":1780,"d":"1,780"}},{"$f":"IF($A$11=1,\"NA\",VLOOKUP($C13&J$7,Data!$B$4:$V$333,$A$8,FALSE))","v":{"v":1560,"d":"1,560"}},{"$f":"IF($A$11=1,\"NA\",VLOOKUP($C13&K$7,Data!$B$4:$V$333,$A$8,FALSE))","v":{"v":1570,"d":"1,570"}},{"$f":"IF($A$11=1,\"NA\",VLOOKUP($C13&L$7,Data!$B$4:$V$333,$A$8,FALSE))","v":{"v":1690,"d":"1,690"}},{"$f":"IF($A$11=1,\"NA\",VLOOKUP($C13&M$7,Data!$B$4:$V$333,$A$8,FALSE))","v":{"v":1600,"d":"1,600"}}]
[null,null,"Dundee City",{"$f":"IF($A$11=1,\"NA\",VLOOKUP($C14&D$7,Data!$B$4:$V$333,$A$8,FALSE))","v":830},{"$f":"IF($A$11=1,\"NA\",VLOOKUP($C14&E$7,Data!$B$4:$V$333,$A$8,FALSE))","v":890},{"$f":"IF($A$11=1,\"NA\",VLOOKUP($C14&F$7,Data!$B$4:$V$333,$A$8,FALSE))","v":{"v":1010,"d":"1,010"}},{"$f":"IF($A$11=1,\"NA\",VLOOKUP($C14&G$7,Data!$B$4:$V$333,$A$8,FALSE))","v":980},{"$f":"IF($A$11=1,\"NA\",VLOOKUP($C14&H$7,Data!$B$4:$V$333,$A$8,FALSE))","v":{"v":1000,"d":"1,000"}},{"$f":"IF($A$11=1,\"NA\",VLOOKUP($C14&I$7,Data!$B$4:$V$333,$A$8,FALSE))","v":990},{"$f":"IF($A$11=1,\"NA\",VLOOKUP($C14&J$7,Data!$B$4:$V$333,$A$8,FALSE))","v":{"v":1060,"d":"1,060"}},{"$f":"IF($A$11=1,\"NA\",VLOOKUP($C14&K$7,Data!$B$4:$V$333,$A$8,FALSE))","v":{"v":1140,"d":"1,140"}},{"$f":"IF($A$11=1,\"NA\",VLOOKUP($C14&L$7,Data!$B$4:$V$333,$A$8,FALSE))","v":{"v":1230,"d":"1,230"}},{"$f":"IF($A$11=1,\"NA\",VLOOKUP($C14&M$7,Data!$B$4:$V$333,$A$8,FALSE))","v":{"v":1250,"d":"1,250"}}]
[null,null,"East Ayrshire",{"$f":"IF($A$11=1,\"NA\",VLOOKUP($C15&D$7,Data!$B$4:$V$333,$A$8,FALSE))","v":{"v":1400,"d":"1,400"}},{"$f":"IF($A$11=1,\"NA\",VLOOKUP($C15&E$7,Data!$B$4:$V$333,$A$8,FALSE))","v":{"v":1500,"d":"1,500"}},{"$f":"IF($A$11=1,\"NA\",VLOOKUP($C15&F$7,Data!$B$4:$V$333,$A$8,FALSE))","v":{"v":1460,"d":"1,460"}},{"$f":"IF($A$11=1,\"NA\",VLOOKUP($C15&G$7,Data!$B$4:$V$333,$A$8,FALSE))","v":{"v":1460,"d":"1,460"}},{"$f":"IF($A$11=1,\"NA\",VLOOKUP($C15&H$7,Data!$B$4:$V$333,$A$8,FALSE))","v":{"v":1610,"d":"1,610"}},{"$f":"IF($A$11=1,\"NA\",VLOOKUP($C15&I$7,Data!$B$4:$V$333,$A$8,FALSE))","v":{"v":1590,"d":"1,590"}},{"$f":"IF($A$11=1,\"NA\",VLOOKUP($C15&J$7,Data!$B$4:$V$333,$A$8,FALSE))","v":{"v":1620,"d":"1,620"}},{"$f":"IF($A$11=1,\"NA\",VLOOKUP($C15&K$7,Data!$B$4:$V$333,$A$8,FALSE))","v":{"v":1530,"d":"1,530"}},{"$f":"IF($A$11=1,\"NA\",VLOOKUP($C15&L$7,Data!$B$4:$V$333,$A$8,FALSE))","v":{"v":1590,"d":"1,590"}},{"$f":"IF($A$11=1,\"NA\",VLOOKUP($C15&M$7,Data!$B$4:$V$333,$A$8,FALSE))","v":{"v":1500,"d":"1,500"}}]
[null,null,"East Dunbartonshire",{"$f":"IF($A$11=1,\"NA\",VLOOKUP($C16&D$7,Data!$B$4:$V$333,$A$8,FALSE))","v":860},{"$f":"IF($A$11=1,\"NA\",VLOOKUP($C16&E$7,Data!$B$4:$V$333,$A$8,FALSE))","v":900},{"$f":"IF($A$11=1,\"NA\",VLOOKUP($C16&F$7,Data!$B$4:$V$333,$A$8,FALSE))","v":{"v":1010,"d":"1,010"}},{"$f":"IF($A$11=1,\"NA\",VLOOKUP($C16&G$7,Data!$B$4:$V$333,$A$8,FALSE))","v":{"v":1010,"d":"1,010"}},{"$f":"IF($A$11=1,\"NA\",VLOOKUP($C16&H$7,Data!$B$4:$V$333,$A$8,FALSE))","v":950},{"$f":"IF($A$11=1,\"NA\",VLOOKUP($C16&I$7,Data!$B$4:$V$333,$A$8,FALSE))","v":960},{"$f":"IF($A$11=1,\"NA\",VLOOKUP($C16&J$7,Data!$B$4:$V$333,$A$8,FALSE))","v":{"v":1050,"d":"1,050"}},{"$f":"IF($A$11=1,\"NA\",VLOOKUP($C16&K$7,Data!$B$4:$V$333,$A$8,FALSE))","v":{"v":1040,"d":"1,040"}},{"$f":"IF($A$11=1,\"NA\",VLOOKUP($C16&L$7,Data!$B$4:$V$333,$A$8,FALSE))","v":{"v":1050,"d":"1,050"}},{"$f":"IF($A$11=1,\"NA\",VLOOKUP($C16&M$7,Data!$B$4:$V$333,$A$8,FALSE))","v":{"v":1070,"d":"1,070"}}]
[null,null,"East Lothian",{"$f":"IF($A$11=1,\"NA\",VLOOKUP($C17&D$7,Data!$B$4:$V$333,$A$8,FALSE))","v":900},{"$f":"IF($A$11=1,\"NA\",VLOOKUP($C17&E$7,Data!$B$4:$V$333,$A$8,FALSE))","v":910},{"$f":"IF($A$11=1,\"NA\",VLOOKUP($C17&F$7,Data!$B$4:$V$333,$A$8,FALSE))","v":920},{"$f":"IF($A$11=1,\"NA\",VLOOKUP($C17&G$7,Data!$B$4:$V$333,$A$8,FALSE))","v":980},{"$f":"IF($A$11=1,\"NA\",VLOOKUP($C17&H$7,Data!$B$4:$V$333,$A$8,FALSE))","v":{"v":1010,"d":"1,010"}},{"$f":"IF($A$11=1,\"NA\",VLOOKUP($C17&I$7,Data!$B$4:$V$333,$A$8,FALSE))","v":{"v":1060,"d":"1,060"}},{"$f":"IF($A$11=1,\"NA\",VLOOKUP($C17&J$7,Data!$B$4:$V$333,$A$8,FALSE))","v":{"v":1090,"d":"1,090"}},{"$f":"IF($A$11=1,\"NA\",VLOOKUP($C17&K$7,Data!$B$4:$V$333,$A$8,FALSE))","v":{"v":1120,"d":"1,120"}},{"$f":"IF($A$11=1,\"NA\",VLOOKUP($C17&L$7,Data!$B$4:$V$333,$A$8,FALSE))","v":{"v":1030,"d":"1,030"}},{"$f":"IF($A$11=1,\"NA\",VLOOKUP($C17&M$7,Data!$B$4:$V$333,$A$8,FALSE))","v":{"v":1030,"d":"1,030"}}]
[null,null,"East Renfrewshire",{"$f":"IF($A$11=1,\"NA\",VLOOKUP($C18&D$7,Data!$B$4:$V$333,$A$8,FALSE))","v":670},{"$f":"IF($A$11=1,\"NA\",VLOOKUP($C18&E$7,Data!$B$4:$V$333,$A$8,FALSE))","v":690},{"$f":"IF($A$11=1,\"NA\",VLOOKUP($C18&F$7,Data!$B$4:$V$333,$A$8,FALSE))","v":770},{"$f":"IF($A$11=1,\"NA\",VLOOKUP($C18&G$7,Data!$B$4:$V$333,$A$8,FALSE))","v":840},{"$f":"IF($A$11=1,\"NA\",VLOOKUP($C18&H$7,Data!$B$4:$V$333,$A$8,FALSE))","v":850},{"$f":"IF($A$11=1,\"NA\",VLOOKUP($C18&I$7,Data!$B$4:$V$333,$A$8,FALSE))","v":890},{"$f":"IF($A$11=1,\"NA\",VLOOKUP($C18&J$7,Data!$B$4:$V$333,$A$8,FALSE))","v":890},{"$f":"IF($A$11=1,\"NA\",VLOOKUP($C18&K$7,Data!$B$4:$V$333,$A$8,FALSE))","v":890},{"$f":"IF($A$11=1,\"NA\",VLOOKUP($C18&L$7,Data!$B$4:$V$333,$A$8,FALSE))","v":750},{"$f":"IF($A$11=1,\"NA\",VLOOKUP($C18&M$7,Data!$B$4:$V$333,$A$8,FALSE))","v":970}]
[null,null,"Edinburgh, City of",{"$f":"IF($A$11=1,\"NA\",VLOOKUP($C19&D$7,Data!$B$4:$V$333,$A$8,FALSE))","v":{"v":2950,"d":"2,950"}},{"$f":"IF($A$11=1,\"NA\",VLOOKUP($C19&E$7,Data!$B$4:$V$333,$A$8,FALSE))","v":{"v":2930,"d":"2,930"}},{"$f":"IF($A$11=1,\"NA\",VLOOKUP($C19&F$7,Data!$B$4:$V$333,$A$8,FALSE))","v":{"v":3380,"d":"3,380"}},{"$f":"IF($A$11=1,\"NA\",VLOOKUP($C19&G$7,Data!$B$4:$V$333,$A$8,FALSE))","v":{"v":3370,"d":"3,370"}},{"$f":"IF($A$11=1,\"NA\",VLOOKUP($C19&H$7,Data!$B$4:$V$333,$A$8,FALSE))","v":{"v":3380,"d":"3,380"}},{"$f":"IF($A$11=1,\"NA\",VLOOKUP($C19&I$7,Data!$B$4:$V$333,$A$8,FALSE))","v":{"v":3400,"d":"3,400"}},{"$f":"IF($A$11=1,\"NA\",VLOOKUP($C19&J$7,Data!$B$4:$V$333,$A$8,FALSE))","v":{"v":3450,"d":"3,450"}},{"$f":"IF($A$11=1,\"NA\",VLOOKUP($C19&K$7,Data!$B$4:$V$333,$A$8,FALSE))","v":{"v":3480,"d":"3,480"}},{"$f":"IF($A$11=1,\"NA\",VLOOKUP($C19&L$7,Data!$B$4:$V$333,$A$8,FALSE))","v":{"v":3400,"d":"3,400"}},{"$f":"IF($A$11=1,\"NA\",VLOOKUP($C19&M$7,Data!$B$4:$V$333,$A$8,FALSE))","v":{"v":3160,"d":"3,160"}}]
[null,null,"Eilean Siar",{"$f":"IF($A$11=1,\"NA\",VLOOKUP($C20&D$7,Data!$B$4:$V$333,$A$8,FALSE))","v":430},{"$f":"IF($A$11=1,\"NA\",VLOOKUP($C20&E$7,Data!$B$4:$V$333,$A$8,FALSE))","v":450},{"$f":"IF($A$11=1,\"NA\",VLOOKUP($C20&F$7,Data!$B$4:$V$333,$A$8,FALSE))","v":460},{"$f":"IF($A$11=1,\"NA\",VLOOKUP($C20&G$7,Data!$B$4:$V$333,$A$8,FALSE))","v":430},{"$f":"IF($A$11=1,\"NA\",VLOOKUP($C20&H$7,Data!$B$4:$V$333,$A$8,FALSE))","v":450},{"$f":"IF($A$11=1,\"NA\",VLOOKUP($C20&I$7,Data!$B$4:$V$333,$A$8,FALSE))","v":460},{"$f":"IF($A$11=1,\"NA\",VLOOKUP($C20&J$7,Data!$B$4:$V$333,$A$8,FALSE))","v":440},{"$f":"IF($A$11=1,\"NA\",VLOOKUP($C20&K$7,Data!$B$4:$V$333,$A$8,FALSE))","v":440},{"$f":"IF($A$11=1,\"NA\",VLOOKUP($C20&L$7,Data!$B$4:$V$333,$A$8,FALSE))","v":390},{"$f":"IF($A$11=1,\"NA\",VLOOKUP($C20&M$7,Data!$B$4:$V$333,$A$8,FALSE))","v":360}]
[null,null,"Falkirk",{"$f":"IF($A$11=1,\"NA\",VLOOKUP($C21&D$7,Data!$B$4:$V$333,$A$8,FALSE))","v":{"v":1250,"d":"1,250"}},{"$f":"IF($A$11=1,\"NA\",VLOOKUP($C21&E$7,Data!$B$4:$V$333,$A$8,FALSE))","v":{"v":1340,"d":"1,340"}},{"$f":"IF($A$11=1,\"NA\",VLOOKUP($C21&F$7,Data!$B$4:$V$333,$A$8,FALSE))","v":{"v":1570,"d":"1,570"}},{"$f":"IF($A$11=1,\"NA\",VLOOKUP($C21&G$7,Data!$B$4:$V$333,$A$8,FALSE))","v":{"v":1570,"d":"1,570"}},{"$f":"IF($A$11=1,\"NA\",VLOOKUP($C21&H$7,Data!$B$4:$V$333,$A$8,FALSE))","v":{"v":1610,"d":"1,610"}},{"$f":"IF($A$11=1,\"NA\",VLOOKUP($C21&I$7,Data!$B$4:$V$333,$A$8,FALSE))","v":{"v":1660,"d":"1,660"}},{"$f":"IF($A$11=1,\"NA\",VLOOKUP($C21&J$7,Data!$B$4:$V$333,$A$8,FALSE))","v":{"v":1740,"d":"1,740"}},{"$f":"IF($A$11=1,\"NA\",VLOOKUP($C21&K$7,Data!$B$4:$V$333,$A$8,FALSE))","v":{"v":1660,"d":"1,660"}},{"$f":"IF($A$11=1,\"NA\",VLOOKUP($C21&L$7,Data!$B$4:$V$333,$A$8,FALSE))","v":{"v":1710,"d":"1,710"}},{"$f":"IF($A$11=1,\"NA\",VLOOKUP($C21&M$7,Data!$B$4:$V$333,$A$8,FALSE))","v":{"v":1670,"d":"1,670"}}]
[null,null,"Fife",{"$f":"IF($A$11=1,\"NA\",VLOOKUP($C22&D$7,Data!$B$4:$V$333,$A$8,FALSE))","v":{"v":3180,"d":"3,180"}},{"$f":"IF($A$11=1,\"NA\",VLOOKUP($C22&E$7,Data!$B$4:$V$333,$A$8,FALSE))","v":{"v":3430,"d":"3,430"}},{"$f":"IF($A$11=1,\"NA\",VLOOKUP($C22&F$7,Data!$B$4:$V$333,$A$8,FALSE))","v":{"v":2850,"d":"2,850"}},{"$f":"IF($A$11=1,\"NA\",VLOOKUP($C22&G$7,Data!$B$4:$V$333,$A$8,FALSE))","v":{"v":2920,"d":"2,920"}},{"$f":"IF($A$11=1,\"NA\",VLOOKUP($C22&H$7,Data!$B$4:$V$333,$A$8,FALSE))","v":{"v":2810,"d":"2,810"}},{"$f":"IF($A$11=1,\"NA\",VLOOKUP($C22&I$7,Data!$B$4:$V$333,$A$8,FALSE))","v":{"v":2870,"d":"2,870"}},{"$f":"IF($A$11=1,\"NA\",VLOOKUP($C22&J$7,Data!$B$4:$V$333,$A$8,FALSE))","v":{"v":2580,"d":"2,580"}},{"$f":"IF($A$11=1,\"NA\",VLOOKUP($C22&K$7,Data!$B$4:$V$333,$A$8,FALSE))","v":{"v":2290,"d":"2,290"}},{"$f":"IF($A$11=1,\"NA\",VLOOKUP($C22&L$7,Data!$B$4:$V$333,$A$8,FALSE))","v":{"v":2400,"d":"2,400"}},{"$f":"IF($A$11=1,\"NA\",VLOOKUP($C22&M$7,Data!$B$4:$V$333,$A$8,FALSE))","v":{"v":1650,"d":"1,650"}}]
[null,null,"Glasgow City",{"$f":"IF($A$11=1,\"NA\",VLOOKUP($C23&D$7,Data!$B$4:$V$333,$A$8,FALSE))","v":{"v":5270,"d":"5,270"}},{"$f":"IF($A$11=1,\"NA\",VLOOKUP($C23&E$7,Data!$B$4:$V$333,$A$8,FALSE))","v":{"v":5150,"d":"5,150"}},{"$f":"IF($A$11=1,\"NA\",VLOOKUP($C23&F$7,Data!$B$4:$V$333,$A$8,FALSE))","v":{"v":6060,"d":"6,060"}},{"$f":"IF($A$11=1,\"NA\",VLOOKUP($C23&G$7,Data!$B$4:$V$333,$A$8,FALSE))","v":{"v":6070,"d":"6,070"}},{"$f":"IF($A$11=1,\"NA\",VLOOKUP($C23&H$7,Data!$B$4:$V$333,$A$8,FALSE))","v":{"v":5910,"d":"5,910"}},{"$f":"IF($A$11=1,\"NA\",VLOOKUP($C23&I$7,Data!$B$4:$V$333,$A$8,FALSE))","v":{"v":5620,"d":"5,620"}},{"$f":"IF($A$11=1,\"NA\",VLOOKUP($C23&J$7,Data!$B$4:$V$333,$A$8,FALSE))","v":{"v":5290,"d":"5,290"}},{"$f":"IF($A$11=1,\"NA\",VLOOKUP($C23&K$7,Data!$B$4:$V$333,$A$8,FALSE))","v":{"v":5380,"d":"5,380"}},{"$f":"IF($A$11=1,\"NA\",VLOOKUP($C23&L$7,Data!$B$4:$V$333,$A$8,FALSE))","v":{"v":5180,"d":"5,180"}},{"$f":"IF($A$11=1,\"NA\",VLOOKUP($C23&M$7,Data!$B$4:$V$333,$A$8,FALSE))","v":{"v":5140,"d":"5,140"}}]
[null,null,"Highland",{"$f":"IF($A$11=1,\"NA\",VLOOKUP($C24&D$7,Data!$B$4:$V$333,$A$8,FALSE))","v":{"v":1480,"d":"1,480"}},{"$f":"IF($A$11=1,\"NA\",VLOOKUP($C24&E$7,Data!$B$4:$V$333,$A$8,FALSE))","v":{"v":1710,"d":"1,710"}},{"$f":"IF($A$11=1,\"NA\",VLOOKUP($C24&F$7,Data!$B$4:$V$333,$A$8,FALSE))","v":{"v":1640,"d":"1,640"}},{"$f":"IF($A$11=1,\"NA\",VLOOKUP($C24&G$7,Data!$B$4:$V$333,$A$8,FALSE))","v":{"v":1610,"d":"1,610"}},{"$f":"IF($A$11=1,\"NA\",VLOOKUP($C24&H$7,Data!$B$4:$V$333,$A$8,FALSE))","v":{"v":1590,"d":"1,590"}},{"$f":"IF($A$11=1,\"NA\",VLOOKUP($C24&I$7,Data!$B$4:$V$333,$A$8,FALSE))","v":{"v":1590,"d":"1,590"}},{"$f":"IF($A$11=1,\"NA\",VLOOKUP($C24&J$7,Data!$B$4:$V$333,$A$8,FALSE))","v":{"v":1710,"d":"1,710"}},{"$f":"IF($A$11=1,\"NA\",VLOOKUP($C24&K$7,Data!$B$4:$V$333,$A$8,FALSE))","v":{"v":1640,"d":"1,640"}},{"$f":"IF($A$11=1,\"NA\",VLOOKUP($C24&L$7,Data!$B$4:$V$333,$A$8,FALSE))","v":{"v":1640,"d":"1,640"}},{"$f":"IF($A$11=1,\"NA\",VLOOKUP($C24&M$7,Data!$B$4:$V$333,$A$8,FALSE))","v":{"v":1590,"d":"1,590"}}]
[null,null,"Inverclyde",{"$f":"IF($A$11=1,\"NA\",VLOOKUP($C25&D$7,Data!$B$4:$V$333,$A$8,FALSE))","v":{"v":1070,"d":"1,070"}},{"$f":"IF($A$11=1,\"NA\",VLOOKUP($C25&E$7,Data!$B$4:$V$333,$A$8,FALSE))","v":{"v":1170,"d":"1,170"}},{"$f":"IF($A$11=1,\"NA\",VLOOKUP($C25&F$7,Data!$B$4:$V$333,$A$8,FALSE))","v":{"v":1090,"d":"1,090"}},{"$f":"IF($A$11=1,\"NA\",VLOOKUP($C25&G$7,Data!$B$4:$V$333,$A$8,FALSE))","v":{"v":1060,"d":"1,060"}},{"$f":"IF($A$11=1,\"NA\",VLOOKUP($C25&H$7,Data!$B$4:$V$333,$A$8,FALSE))","v":{"v":1060,"d":"1,060"}},{"$f":"IF($A$11=1,\"NA\",VLOOKUP($C25&I$7,Data!$B$4:$V$333,$A$8,FALSE))","v":{"v":1120,"d":"1,120"}},{"$f":"IF($A$11=1,\"NA\",VLOOKUP($C25&J$7,Data!$B$4:$V$333,$A$8,FALSE))","v":{"v":1100,"d":"1,100"}},{"$f":"IF($A$11=1,\"NA\",VLOOKUP($C25&K$7,Data!$B$4:$V$333,$A$8,FALSE))","v":{"v":1030,"d":"1,030"}},{"$f":"IF($A$11=1,\"NA\",VLOOKUP($C25&L$7,Data!$B$4:$V$333,$A$8,FALSE))","v":{"v":1130,"d":"1,130"}},{"$f":"IF($A$11=1,\"NA\",VLOOKUP($C25&M$7,Data!$B$4:$V$333,$A$8,FALSE))","v":{"v":1140,"d":"1,140"}}]
[null,null,"Midlothian",{"$f":"IF($A$11=1,\"NA\",VLOOKUP($C26&D$7,Data!$B$4:$V$333,$A$8,FALSE))","v":550},{"$f":"IF($A$11=1,\"NA\",VLOOKUP($C26&E$7,Data!$B$4:$V$333,$A$8,FALSE))","v":640},{"$f":"IF($A$11=1,\"NA\",VLOOKUP($C26&F$7,Data!$B$4:$V$333,$A$8,FALSE))","v":610},{"$f":"IF($A$11=1,\"NA\",VLOOKUP($C26&G$7,Data!$B$4:$V$333,$A$8,FALSE))","v":680},{"$f":"IF($A$11=1,\"NA\",VLOOKUP($C26&H$7,Data!$B$4:$V$333,$A$8,FALSE))","v":740},{"$f":"IF($A$11=1,\"NA\",VLOOKUP($C26&I$7,Data!$B$4:$V$333,$A$8,FALSE))","v":770},{"$f":"IF($A$11=1,\"NA\",VLOOKUP($C26&J$7,Data!$B$4:$V$333,$A$8,FALSE))","v":760},{"$f":"IF($A$11=1,\"NA\",VLOOKUP($C26&K$7,Data!$B$4:$V$333,$A$8,FALSE))","v":650},{"$f":"IF($A$11=1,\"NA\",VLOOKUP($C26&L$7,Data!$B$4:$V$333,$A$8,FALSE))","v":770},{"$f":"IF($A$11=1,\"NA\",VLOOKUP($C26&M$7,Data!$B$4:$V$333,$A$8,FALSE))","v":830}]
[null,null,"Moray",{"$f":"IF($A$11=1,\"NA\",VLOOKUP($C27&D$7,Data!$B$4:$V$333,$A$8,FALSE))","v":760},{"$f":"IF($A$11=1,\"NA\",VLOOKUP($C27&E$7,Data!$B$4:$V$333,$A$8,FALSE))","v":780},{"$f":"IF($A$11=1,\"NA\",VLOOKUP($C27&F$7,Data!$B$4:$V$333,$A$8,FALSE))","v":800},{"$f":"IF($A$11=1,\"NA\",VLOOKUP($C27&G$7,Data!$B$4:$V$333,$A$8,FALSE))","v":880},{"$f":"IF($A$11=1,\"NA\",VLOOKUP($C27&H$7,Data!$B$4:$V$333,$A$8,FALSE))","v":920},{"$f":"IF($A$11=1,\"NA\",VLOOKUP($C27&I$7,Data!$B$4:$V$333,$A$8,FALSE))","v":930},{"$f":"IF($A$11=1,\"NA\",VLOOKUP($C27&J$7,Data!$B$4:$V$333,$A$8,FALSE))","v":900},{"$f":"IF($A$11=1,\"NA\",VLOOKUP($C27&K$7,Data!$B$4:$V$333,$A$8,FALSE))","v":930},{"$f":"IF($A$11=1,\"NA\",VLOOKUP($C27&L$7,Data!$B$4:$V$333,$A$8,FALSE))","v":880},{"$f":"IF($A$11=1,\"NA\",VLOOKUP($C27&M$7,Data!$B$4:$V$333,$A$8,FALSE))","v":780}]
[null,null,"North Ayrshire",{"$f":"IF($A$11=1,\"NA\",VLOOKUP($C28&D$7,Data!$B$4:$V$333,$A$8,FALSE))","v":{"v":1230,"d":"1,230"}},{"$f":"IF($A$11=1,\"NA\",VLOOKUP($C28&E$7,Data!$B$4:$V$333,$A$8,FALSE))","v":{"v":1410,"d":"1,410"}},{"$f":"IF($A$11=1,\"NA\",VLOOKUP($C28&F$7,Data!$B$4:$V$333,$A$8,FALSE))","v":{"v":1230,"d":"1,230"}},{"$f":"IF($A$11=1,\"NA\",VLOOKUP($C28&G$7,Data!$B$4:$V$333,$A$8,FALSE))","v":{"v":1310,"d":"1,310"}},{"$f":"IF($A$11=1,\"NA\",VLOOKUP($C28&H$7,Data!$B$4:$V$333,$A$8,FALSE))","v":{"v":1360,"d":"1,360"}},{"$f":"IF($A$11=1,\"NA\",VLOOKUP($C28&I$7,Data!$B$4:$V$333,$A$8,FALSE))","v":{"v":1510,"d":"1,510"}},{"$f":"IF($A$11=1,\"NA\",VLOOKUP($C28&J$7,Data!$B$4:$V$333,$A$8,FALSE))","v":{"v":1620,"d":"1,620"}},{"$f":"IF($A$11=1,\"NA\",VLOOKUP($C28&K$7,Data!$B$4:$V$333,$A$8,FALSE))","v":{"v":1680,"d":"1,680"}},{"$f":"IF($A$11=1,\"NA\",VLOOKUP($C28&L$7,Data!$B$4:$V$333,$A$8,FALSE))","v":{"v":1620,"d":"1,620"}},{"$f":"IF($A$11=1,\"NA\",VLOOKUP($C28&M$7,Data!$B$4:$V$333,$A$8,FALSE))","v":{"v":1590,"d":"1,590"}}]
[null,null,"North Lanarkshire",{"$f":"IF($A$11=1,\"NA\",VLOOKUP($C29&D$7,Data!$B$4:$V$333,$A$8,FALSE))","v":{"v":2320,"d":"2,320"}},{"$f":"IF($A$11=1,\"NA\",VLOOKUP($C29&E$7,Data!$B$4:$V$333,$A$8,FALSE))","v":{"v":2400,"d":"2,400"}},{"$f":"IF($A$11=1,\"NA\",VLOOKUP($C29&F$7,Data!$B$4:$V$333,$A$8,FALSE))","v":{"v":2660,"d":"2,660"}},{"$f":"IF($A$11=1,\"NA\",VLOOKUP($C29&G$7,Data!$B$4:$V$333,$A$8,FALSE))","v":{"v":2600,"d":"2,600"}},{"$f":"IF($A$11=1,\"NA\",VLOOKUP($C29&H$7,Data!$B$4:$V$333,$A$8,FALSE))","v":{"v":2630,"d":"2,630"}},{"$f":"IF($A$11=1,\"NA\",VLOOKUP($C29&I$7,Data!$B$4:$V$333,$A$8,FALSE))","v":{"v":2720,"d":"2,720"}},{"$f":"IF($A$11=1,\"NA\",VLOOKUP($C29&J$7,Data!$B$4:$V$333,$A$8,FALSE))","v":{"v":2850,"d":"2,850"}},{"$f":"IF($A$11=1,\"NA\",VLOOKUP($C29&K$7,Data!$B$4:$V$333,$A$8,FALSE))","v":{"v":3040,"d":"3,040"}},{"$f":"IF($A$11=1,\"NA\",VLOOKUP($C29&L$7,Data!$B$4:$V$333,$A$8,FALSE))","v":{"v":3120,"d":"3,120"}},{"$f":"IF($A$11=1,\"NA\",VLOOKUP($C29&M$7,Data!$B$4:$V$333,$A$8,FALSE))","v":{"v":3120,"d":"3,120"}}]
[null,null,"Orkney Islands",{"$f":"IF($A$11=1,\"NA\",VLOOKUP($C30&D$7,Data!$B$4:$V$333,$A$8,FALSE))","v":170},{"$f":"IF($A$11=1,\"NA\",VLOOKUP($C30&E$7,Data!$B$4:$V$333,$A$8,FALSE))","v":210},{"$f":"IF($A$11=1,\"NA\",VLOOKUP($C30&F$7,Data!$B$4:$V$333,$A$8,FALSE))","v":250},{"$f":"IF($A$11=1,\"NA\",VLOOKUP($C30&G$7,Data!$B$4:$V$333,$A$8,FALSE))","v":220},{"$f":"IF($A$11=1,\"NA\",VLOOKUP($C30&H$7,Data!$B$4:$V$333,$A$8,FALSE))","v":210},{"$f":"IF($A$11=1,\"NA\",VLOOKUP($C30&I$7,Data!$B$4:$V$333,$A$8,FALSE))","v":210},{"$f":"IF($A$11=1,\"NA\",VLOOKUP($C30&J$7,Data!$B$4:$V$333,$A$8,FALSE))","v":240},{"$f":"IF($A$11=1,\"NA\",VLOOKUP($C30&K$7,Data!$B$4:$V$333,$A$8,FALSE))","v":240},{"$f":"IF($A$11=1,\"NA\",VLOOKUP($C30&L$7,Data!$B$4:$V$333,$A$8,FALSE))","v":170},{"$f":"IF($A$11=1,\"NA\",VLOOKUP($C30&M$7,Data!$B$4:$V$333,$A$8,FALSE))","v":180}]
[null,null,"Perth & Kinross",{"$f":"IF($A$11=1,\"NA\",VLOOKUP($C31&D$7,Data!$B$4:$V$333,$A$8,FALSE))","v":{"v":1000,"d":"1,000"}},{"$f":"IF($A$11=1,\"NA\",VLOOKUP($C31&E$7,Data!$B$4:$V$333,$A$8,FALSE))","v":{"v":1050,"d":"1,050"}},{"$f":"IF($A$11=1,\"NA\",VLOOKUP($C31&F$7,Data!$B$4:$V$333,$A$8,FALSE))","v":{"v":1260,"d":"1,260"}},{"$f":"IF($A$11=1,\"NA\",VLOOKUP($C31&G$7,Data!$B$4:$V$333,$A$8,FALSE))","v":{"v":1320,"d":"1,320"}},{"$f":"IF($A$11=1,\"NA\",VLOOKUP($C31&H$7,Data!$B$4:$V$333,$A$8,FALSE))","v":{"v":1130,"d":"1,130"}},{"$f":"IF($A$11=1,\"NA\",VLOOKUP($C31&I$7,Data!$B$4:$V$333,$A$8,FALSE))","v":{"v":1100,"d":"1,100"}},{"$f":"IF($A$11=1,\"NA\",VLOOKUP($C31&J$7,Data!$B$4:$V$333,$A$8,FALSE))","v":{"v":1230,"d":"1,230"}},{"$f":"IF($A$11=1,\"NA\",VLOOKUP($C31&K$7,Data!$B$4:$V$333,$A$8,FALSE))","v":{"v":1080,"d":"1,080"}},{"$f":"IF($A$11=1,\"NA\",VLOOKUP($C31&L$7,Data!$B$4:$V$333,$A$8,FALSE))","v":{"v":1120,"d":"1,120"}},{"$f":"IF($A$11=1,\"NA\",VLOOKUP($C31&M$7,Data!$B$4:$V$333,$A$8,FALSE))","v":{"v":1200,"d":"1,200"}}]
[null,null,"Renfrewshire",{"$f":"IF($A$11=1,\"NA\",VLOOKUP($C32&D$7,Data!$B$4:$V$333,$A$8,FALSE))","v":{"v":1110,"d":"1,110"}},{"$f":"IF($A$11=1,\"NA\",VLOOKUP($C32&E$7,Data!$B$4:$V$333,$A$8,FALSE))","v":{"v":1190,"d":"1,190"}},{"$f":"IF($A$11=1,\"NA\",VLOOKUP($C32&F$7,Data!$B$4:$V$333,$A$8,FALSE))","v":{"v":1370,"d":"1,370"}},{"$f":"IF($A$11=1,\"NA\",VLOOKUP($C32&G$7,Data!$B$4:$V$333,$A$8,FALSE))","v":{"v":1200,"d":"1,200"}},{"$f":"IF($A$11=1,\"NA\",VLOOKUP($C32&H$7,Data!$B$4:$V$333,$A$8,FALSE))","v":{"v":1260,"d":"1,260"}},{"$f":"IF($A$11=1,\"NA\",VLOOKUP($C32&I$7,Data!$B$4:$V$333,$A$8,FALSE))","v":{"v":1370,"d":"1,370"}},{"$f":"IF($A$11=1,\"NA\",VLOOKUP($C32&J$7,Data!$B$4:$V$333,$A$8,FALSE))","v":{"v":1490,"d":"1,490"}},{"$f":"IF($A$11=1,\"NA\",VLOOKUP($C32&K$7,Data!$B$4:$V$333,$A$8,FALSE))","v":{"v":1720,"d":"1,720"}},{"$f":"IF($A$11=1,\"NA\",VLOOKUP($C32&L$7,Data!$B$4:$V$333,$A$8,FALSE))","v":{"v":1650,"d":"1,650"}},{"$f":"IF($A$11=1,\"NA\",VLOOKUP($C32&M$7,Data!$B$4:$V$333,$A$8,FALSE))","v":{"v":1590,"d":"1,590"}}]
[null,null,"Scottish Borders",{"$f":"IF($A$11=1,\"NA\",VLOOKUP($C33&D$7,Data!$B$4:$V$333,$A$8,FALSE))","v":{"v":1040,"d":"1,040"}},{"$f":"IF($A$11=1,\"NA\",VLOOKUP($C33&E$7,Data!$B$4:$V$333,$A$8,FALSE))","v":{"v":1050,"d":"1,050"}},{"$f":"IF($A$11=1,\"NA\",VLOOKUP($C33&F$7,Data!$B$4:$V$333,$A$8,FALSE))","v":{"v":1160,"d":"1,160"}},{"$f":"IF($A$11=1,\"NA\",VLOOKUP($C33&G$7,Data!$B$4:$V$333,$A$8,FALSE))","v":{"v":1190,"d":"1,190"}},{"$f":"IF($A$11=1,\"NA\",VLOOKUP($C33&H$7,Data!$B$4:$V$333,$A$8,FALSE))","v":{"v":1240,"d":"1,240"}},{"$f":"IF($A$11=1,\"NA\",VLOOKUP($C33&I$7,Data!$B$4:$V$333,$A$8,FALSE))","v":{"v":1250,"d":"1,250"}},{"$f":"IF($A$11=1,\"NA\",VLOOKUP($C33&J$7,Data!$B$4:$V$333,$A$8,FALSE))","v":{"v":1240,"d":"1,240"}},{"$f":"IF($A$11=1,\"NA\",VLOOKUP($C33&K$7,Data!$B$4:$V$333,$A$8,FALSE))","v":{"v":1150,"d":"1,150"}},{"$f":"IF($A$11=1,\"NA\",VLOOKUP($C33&L$7,Data!$B$4:$V$333,$A$8,FALSE))","v":{"v":1160,"d":"1,160"}},{"$f":"IF($A$11=1,\"NA\",VLOOKUP($C33&M$7,Data!$B$4:$V$333,$A$8,FALSE))","v":{"v":1090,"d":"1,090"}}]
[null,null,"Shetland Islands",{"$f":"IF($A$11=1,\"NA\",VLOOKUP($C34&D$7,Data!$B$4:$V$333,$A$8,FALSE))","v":210},{"$f":"IF($A$11=1,\"NA\",VLOOKUP($C34&E$7,Data!$B$4:$V$333,$A$8,FALSE))","v":220},{"$f":"IF($A$11=1,\"NA\",VLOOKUP($C34&F$7,Data!$B$4:$V$333,$A$8,FALSE))","v":230},{"$f":"IF($A$11=1,\"NA\",VLOOKUP($C34&G$7,Data!$B$4:$V$333,$A$8,FALSE))","v":260},{"$f":"IF($A$11=1,\"NA\",VLOOKUP($C34&H$7,Data!$B$4:$V$333,$A$8,FALSE))","v":230},{"$f":"IF($A$11=1,\"NA\",VLOOKUP($C34&I$7,Data!$B$4:$V$333,$A$8,FALSE))","v":220},{"$f":"IF($A$11=1,\"NA\",VLOOKUP($C34&J$7,Data!$B$4:$V$333,$A$8,FALSE))","v":220},{"$f":"IF($A$11=1,\"NA\",VLOOKUP($C34&K$7,Data!$B$4:$V$333,$A$8,FALSE))","v":220},{"$f":"IF($A$11=1,\"NA\",VLOOKUP($C34&L$7,Data!$B$4:$V$333,$A$8,FALSE))","v":200},{"$f":"IF($A$11=1,\"NA\",VLOOKUP($C34&M$7,Data!$B$4:$V$333,$A$8,FALSE))","v":200}]
[null,null,"South Ayrshire",{"$f":"IF($A$11=1,\"NA\",VLOOKUP($C35&D$7,Data!$B$4:$V$333,$A$8,FALSE))","v":{"v":1440,"d":"1,440"}},{"$f":"IF($A$11=1,\"NA\",VLOOKUP($C35&E$7,Data!$B$4:$V$333,$A$8,FALSE))","v":{"v":1540,"d":"1,540"}},{"$f":"IF($A$11=1,\"NA\",VLOOKUP($C35&F$7,Data!$B$4:$V$333,$A$8,FALSE))","v":{"v":1630,"d":"1,630"}},{"$f":"IF($A$11=1,\"NA\",VLOOKUP($C35&G$7,Data!$B$4:$V$333,$A$8,FALSE))","v":{"v":1740,"d":"1,740"}},{"$f":"IF($A$11=1,\"NA\",VLOOKUP($C35&H$7,Data!$B$4:$V$333,$A$8,FALSE))","v":{"v":1600,"d":"1,600"}},{"$f":"IF($A$11=1,\"NA\",VLOOKUP($C35&I$7,Data!$B$4:$V$333,$A$8,FALSE))","v":{"v":1660,"d":"1,660"}},{"$f":"IF($A$11=1,\"NA\",VLOOKUP($C35&J$7,Data!$B$4:$V$333,$A$8,FALSE))","v":{"v":1460,"d":"1,460"}},{"$f":"IF($A$11=1,\"NA\",VLOOKUP($C35&K$7,Data!$B$4:$V$333,$A$8,FALSE))","v":{"v":1340,"d":"1,340"}},{"$f":"IF($A$11=1,\"NA\",VLOOKUP($C35&L$7,Data!$B$4:$V$333,$A$8,FALSE))","v":{"v":1280,"d":"1,280"}},{"$f":"IF($A$11=1,\"NA\",VLOOKUP($C35&M$7,Data!$B$4:$V$333,$A$8,FALSE))","v":{"v":1330,"d":"1,330"}}]
[null,null,"South Lanarkshire",{"$f":"IF($A$11=1,\"NA\",VLOOKUP($C36&D$7,Data!$B$4:$V$333,$A$8,FALSE))","v":{"v":2600,"d":"2,600"}},{"$f":"IF($A$11=1,\"NA\",VLOOKUP($C36&E$7,Data!$B$4:$V$333,$A$8,FALSE))","v":{"v":2700,"d":"2,700"}},{"$f":"IF($A$11=1,\"NA\",VLOOKUP($C36&F$7,Data!$B$4:$V$333,$A$8,FALSE))","v":{"v":2840,"d":"2,840"}},{"$f":"IF($A$11=1,\"NA\",VLOOKUP($C36&G$7,Data!$B$4:$V$333,$A$8,FALSE))","v":{"v":2790,"d":"2,790"}},{"$f":"IF($A$11=1,\"NA\",VLOOKUP($C36&H$7,Data!$B$4:$V$333,$A$8,FALSE))","v":{"v":2820,"d":"2,820"}},{"$f":"IF($A$11=1,\"NA\",VLOOKUP($C36&I$7,Data!$B$4:$V$333,$A$8,FALSE))","v":{"v":2790,"d":"2,790"}},{"$f":"IF($A$11=1,\"NA\",VLOOKUP($C36&J$7,Data!$B$4:$V$333,$A$8,FALSE))","v":{"v":2820,"d":"2,820"}},{"$f":"IF($A$11=1,\"NA\",VLOOKUP($C36&K$7,Data!$B$4:$V$333,$A$8,FALSE))","v":{"v":2710,"d":"2,710"}},{"$f":"IF($A$11=1,\"NA\",VLOOKUP($C36&L$7,Data!$B$4:$V$333,$A$8,FALSE))","v":{"v":2690,"d":"2,690"}},{"$f":"IF($A$11=1,\"NA\",VLOOKUP($C36&M$7,Data!$B$4:$V$333,$A$8,FALSE))","v":{"v":2840,"d":"2,840"}}]
[null,null,"Stirling",{"$f":"IF($A$11=1,\"NA\",VLOOKUP($C37&D$7,Data!$B$4:$V$333,$A$8,FALSE))","v":450},{"$f":"IF($A$11=1,\"NA\",VLOOKUP($C37&E$7,Data!$B$4:$V$333,$A$8,FALSE))","v":470},{"$f":"IF($A$11=1,\"NA\",VLOOKUP($C37&F$7,Data!$B$4:$V$333,$A$8,FALSE))","v":630},{"$f":"IF($A$11=1,\"NA\",VLOOKUP($C37&G$7,Data!$B$4:$V$333,$A$8,FALSE))","v":640},{"$f":"IF($A$11=1,\"NA\",VLOOKUP($C37&H$7,Data!$B$4:$V$333,$A$8,FALSE))","v":690},{"$f":"IF($A$11=1,\"NA\",VLOOKUP($C37&I$7,Data!$B$4:$V$333,$A$8,FALSE))","v":790},{"$f":"IF($A$11=1,\"NA\",VLOOKUP($C37&J$7,Data!$B$4:$V$333,$A$8,FALSE))","v":780},{"$f":"IF($A$11=1,\"NA\",VLOOKUP($C37&K$7,Data!$B$4:$V$333,$A$8,FALSE))","v":810},{"$f":"IF($A$11=1,\"NA\",VLOOKUP($C37&L$7,Data!$B$4:$V$333,$A$8,FALSE))","v":780},{"$f":"IF($A$11=1,\"NA\",VLOOKUP($C37&M$7,Data!$B$4:$V$333,$A$8,FALSE))","v":790}]
[null,null,"West Dunbartonshire",{"$f":"IF($A$11=1,\"NA\",VLOOKUP($C38&D$7,Data!$B$4:$V$333,$A$8,FALSE))","v":{"v":1010,"d":"1,010"}},{"$f":"IF($A$11=1,\"NA\",VLOOKUP($C38&E$7,Data!$B$4:$V$333,$A$8,FALSE))","v":{"v":1020,"d":"1,020"}},{"$f":"IF($A$11=1,\"NA\",VLOOKUP($C38&F$7,Data!$B$4:$V$333,$A$8,FALSE))","v":{"v":1100,"d":"1,100"}},{"$f":"IF($A$11=1,\"NA\",VLOOKUP($C38&G$7,Data!$B$4:$V$333,$A$8,FALSE))","v":{"v":1070,"d":"1,070"}},{"$f":"IF($A$11=1,\"NA\",VLOOKUP($C38&H$7,Data!$B$4:$V$333,$A$8,FALSE))","v":{"v":1110,"d":"1,110"}},{"$f":"IF($A$11=1,\"NA\",VLOOKUP($C38&I$7,Data!$B$4:$V$333,$A$8,FALSE))","v":{"v":1040,"d":"1,040"}},{"$f":"IF($A$11=1,\"NA\",VLOOKUP($C38&J$7,Data!$B$4:$V$333,$A$8,FALSE))","v":{"v":1070,"d":"1,070"}},{"$f":"IF($A$11=1,\"NA\",VLOOKUP($C38&K$7,Data!$B$4:$V$333,$A$8,FALSE))","v":{"v":1110,"d":"1,110"}},{"$f":"IF($A$11=1,\"NA\",VLOOKUP($C38&L$7,Data!$B$4:$V$333,$A$8,FALSE))","v":{"v":1180,"d":"1,180"}},{"$f":"IF($A$11=1,\"NA\",VLOOKUP($C38&M$7,Data!$B$4:$V$333,$A$8,FALSE))","v":{"v":1270,"d":"1,270"}}]
[null,null,"West Lothian",{"$f":"IF($A$11=1,\"NA\",VLOOKUP($C39&D$7,Data!$B$4:$V$333,$A$8,FALSE))","v":{"v":1000,"d":"1,000"}},{"$f":"IF($A$11=1,\"NA\",VLOOKUP($C39&E$7,Data!$B$4:$V$333,$A$8,FALSE))","v":{"v":1130,"d":"1,130"}},{"$f":"IF($A$11=1,\"NA\",VLOOKUP($C39&F$7,Data!$B$4:$V$333,$A$8,FALSE))","v":{"v":1230,"d":"1,230"}},{"$f":"IF($A$11=1,\"NA\",VLOOKUP($C39&G$7,Data!$B$4:$V$333,$A$8,FALSE))","v":{"v":1280,"d":"1,280"}},{"$f":"IF($A$11=1,\"NA\",VLOOKUP($C39&H$7,Data!$B$4:$V$333,$A$8,FALSE))","v":{"v":1250,"d":"1,250"}},{"$f":"IF($A$11=1,\"NA\",VLOOKUP($C39&I$7,Data!$B$4:$V$333,$A$8,FALSE))","v":{"v":1300,"d":"1,300"}},{"$f":"IF($A$11=1,\"NA\",VLOOKUP($C39&J$7,Data!$B$4:$V$333,$A$8,FALSE))","v":{"v":1430,"d":"1,430"}},{"$f":"IF($A$11=1,\"NA\",VLOOKUP($C39&K$7,Data!$B$4:$V$333,$A$8,FALSE))","v":{"v":1360,"d":"1,360"}},{"$f":"IF($A$11=1,\"NA\",VLOOKUP($C39&L$7,Data!$B$4:$V$333,$A$8,FALSE))","v":{"v":1510,"d":"1,510"}},{"$f":"IF($A$11=1,\"NA\",VLOOKUP($C39&M$7,Data!$B$4:$V$333,$A$8,FALSE))","v":{"v":1150,"d":"1,150"}}]
[null,null,"Scotland",{"$f":"IF($A$11=1,\"NA\",VLOOKUP($C40&D$7,Data!$B$4:$V$333,$A$8,FALSE))","v":{"v":42260,"d":"42,260"}},{"$f":"IF($A$11=1,\"NA\",VLOOKUP($C40&E$7,Data!$B$4:$V$333,$A$8,FALSE))","v":{"v":44200,"d":"44,200"}},{"$f":"IF($A$11=1,\"NA\",VLOOKUP($C40&F$7,Data!$B$4:$V$333,$A$8,FALSE))","v":{"v":46660,"d":"46,660"}},{"$f":"IF($A$11=1,\"NA\",VLOOKUP($C40&G$7,Data!$B$4:$V$333,$A$8,FALSE))","v":{"v":46950,"d":"46,950"}},{"$f":"IF($A$11=1,\"NA\",VLOOKUP($C40&H$7,Data!$B$4:$V$333,$A$8,FALSE))","v":{"v":47010,"d":"47,010"}},{"$f":"IF($A$11=1,\"NA\",VLOOKUP($C40&I$7,Data!$B$4:$V$333,$A$8,FALSE))","v":{"v":47170,"d":"47,170"}},{"$f":"IF($A$11=1,\"NA\",VLOOKUP($C40&J$7,Data!$B$4:$V$333,$A$8,FALSE))","v":{"v":47810,"d":"47,810"}},{"$f":"IF($A$11=1,\"NA\",VLOOKUP($C40&K$7,Data!$B$4:$V$333,$A$8,FALSE))","v":{"v":46750,"d":"46,750"}},{"$f":"IF($A$11=1,\"NA\",VLOOKUP($C40&L$7,Data!$B$4:$V$333,$A$8,FALSE))","v":{"v":46910,"d":"46,910"}},{"$f":"IF($A$11=1,\"NA\",VLOOKUP($C40&M$7,Data!$B$4:$V$333,$A$8,FALSE))","v":{"v":45780,"d":"45,780"}}]
[]
[null,null,"Source: Community Care Quarterly Key Monitoring Return (Client data), Social Care Survey 2013 onwards, FPNC survey and LFR3 (Expenditure data), NRS mid-year estimates (population data)"]
[null,null,{"$f":"IF($A$6=\"Clients\",\"FPC figures are yearly averages rounded to the nearest 10.\",\"FPC figures are in £thousands. Overheads not included for all years, full details of the years affected are included within the background notes\")","v":"FPC figures are yearly averages rounded to the nearest 10."}]
[null,null,{"$f":"IF(A5=\"Average weekly hours of FPC at home\",\"Average weekly hours (based on last week of each quarter) rounded to the nearest 100.\",\"\")","v":""}]